{"text_format":"1","workbook":"xlsx","n_sheets":16,"sheets":["Manual","Tables","Ship","BL-BR Data","T4 Data","HTML","WTables","Laser","PAWS","Meson","Missile","Sheet1","sheet 2","Tab","CPRGun","Gauss"],"not_rendered":{"charts":0,"images":0,"macros":0,"external_links":1,"defined_names":2,"comments":0,"pivot_tables":0},"unopened":[],"bounds":{"document_bytes":16777216,"sheet_cells":100000,"rows_first":2000,"rows_last":500,"rows_between":2000,"halvings":0,"cell_chars":16384,"cell_head_chars":4096},"cells_cut":0,"cells_raw":0,"read":"whole","date_system":"1900"}

{"sheet":"Manual","index":0,"n_rows":142,"n_cols":2,"rows_kept":142,"cut":false,"hidden":false,"merged":[]}
["This text contains instructions how to use the \"BR-98R4\" Traveller starship design spreadsheet."]
[]
["0. Basics"]
[null,"All numbers shown on bold font are intended for user input."]
[]
[null,"When the instructions prompts you to \"enter\" a value, you"]
[null,"should type the new value over a existing bolded value."]
[]
[null,"When the instructions prompts you to \"select\" an equipment, you "]
[null,"should open a pull-down menu, and select a item."]
[]
[null,"Many components have both \"enter\" and \"select\" values. For "]
[null,"example you might select that the auxiliary computer "]
[null,"is \"Fiber Optic\", and then enter value 2. This "]
[null,"would mean that the ship has two fibre-optic auxiliary "]
[null,"computers."]
[]
["1. Hull"]
[null,"Enter the Tech Level and Hull Size, and then select the hull Shape and Configuration."]
[null,"Enter the ship Name and select the ship Type and desired operation time."]
[null,"Select the hull shell material and endter the armor value."]
[null,"If asteroid hull is desired, select asteroid type and armor value."]
[null,"Select the Internal Structure algorithm."]
[]
["2. Faster than liget (FTL) drive"]
[null,"Select the drive type and enter the speed parameter (jump number or drive power)"]
[null,"Select the gate type and enter the gate capacity. If stargate is selected, enter the gate length."]
[null,"If Jump drive is used, enter the jump fuel endurance."]
[null,"Note: If the ship do not have a FTL drive, select FTL Drive: None"]
[]
["3. Sublight Drive"]
[null,"Select the type of Main Drive and Auxiliary Drive and enter the drive acceleration."]
[null,"If Main or Aux drive uses fuel, enter the desired number of G-turns."]
[null,"Select a desired type of lifter."]
[]
["4. Power Plant"]
[null,"Select the Power Plant type, and enter the output power [MW] and fuel endurance [years]."]
[null,"Select the scale efficiency formula."]
[]
["5. Control Systems"]
[null,"Select the automation level."]
[null,"Enter the number of main and auxiliary computers, and select the computer types."]
[null,"Note that \"Flight\" computers are not used in starships"]
[]
["6. Communications"]
[null,"For each type of communicator, select the broadcast range, and enter the number of"]
[null," communicator units."]
[]
["7. Sensors"]
[null,"For each type of sensor, select the short range, and enter the number of sensor units."]
[null,"The PEMS (or HRT) sensor array may be folding or fixed, depending on the antenna"]
[null,"diamteter and hull size."]
[]
["8. Electronic Countermeasures"]
[null,"For radio and EMS jammer, select the short range, and enter the number of ECM units."]
[null,"Enter the jamming radius and number of jamming units for area jammer."]
[null,"Select the type of stealth system."]
[]
["9. Weapons"]
[null,"Select the weapon system, and enter the number of weapons. "]
[null,"Select the defense system, and enter the number of defense systems."]
[null,"Enter the volume of missile magazine."]
[null,"Note: weapons designed on weapon sheets are available on pull-down menus."]
[]
["10. Screens"]
[null,"Enter the range and number of units for nuclear damper."]
[null,"Enter the meson screen protection value [PV] and number of units."]
[]
["11. Fire Control"]
[null,"Select the Master Fire Director's short range and enter the nimber of MFDs."]
[null,"Select the type and enter the number of MFD missile control communicators."]
[]
["12. Optional Features"]
[null,"Enter the fuel scoop area percentage."]
[null,"Enter the fuel purification plant capacity (note the minimum volume)."]
[null,"Enter the numbers of special facilities."]
[null,"Select the types of vehicle service facilities, enter the number of facilities and the"]
[null,"maximum volume [DT] of serviced subcrafts."]
[null,"Select the volume [DT] and enter the number of empty bays."]
[null,"Select the type of passenger seats and enter the number of seats."]
[null,"Select the fuel type and enter the volume [DT] of extra fuel tank."]
[null,"Enter the volume [DT] of cargo hold. (Note: while the value is entered as DTs, it is"]
[null,"possible to enter a formula in te shell. A 100 m3 cargo volume can be done by"]
[null,"entering \"=100/14\" to the shell."]
[]
["13. Life Support"]
[null,"Select the type and volume of life support and artifical gravity."]
[null,"Enter the number of crew G tanks."]
[null,"Enter the number of high, middle and low passengers"]
[null,"Enter the number of extended accommodation units and notice the "]
[null,"minimum values shown on K-column."]
[null,"Note: When selecting the volume of life support and artifical gravity, the selections are:"]
[null,"Full: All except hull shell is included"]
[null,"Reduced: All except hull shell and fuel tanks."]
[null,"Minimal: Includes only crew quaters, workstations, etc."]
[]
["14. Crew"]
[null,"Enter the number of ships troops and flight crew. "]
[null,"Flight crew are used to operate subcrafts, but if there is only "]
[null,"few subcrafts they can be operated by normal crew members. "]
[null,"Fighters, tanks, and assault speeders should always have flight "]
[null,"crew."]
[]
[]
["15. Subcrafts"]
[null,"Enter the total Mass and Price of all carried subcrafts. If the "]
[null,"subcrafts are carried outside of the main hull (in grapples or "]
[null,"docking rings), their total Volume must also be entered."]
[]
["16. Evaluation"]
[null,"The remaining Volume and Surface Area values in must be "]
[null,"zero or greater, otherwise there is something wrong in the "]
[null,"design. Remaining power may be less than zero, which means that "]
[null,"all ship components cannot be used simultaneously."]
[]
["Known bugs and limitations"]
[null,"Tech Levels: Some equipment are not available on lower TL, and "]
[null,"when incorrect values are chose, the spreadsheet row will show "]
[null,"either zeroes or #VALUE!. In this case change the equipment "]
[null,"values until normal numbers can be seen."]
[]
[null,"For quick reference, some of the weapon capabilities can be read "]
[null,"from its name. For example a common TL-14 laser is called "]
[null,"LTR-150-10-4, and the name means \"Laser Turret, Remote mount, "]
[null,"150 MJ pulse, 10 hex range, can be overpowered to -4 Diff Mods\"."]
[]
["Brilliant Lances Damage Tables"]
[null,"In BL the ship's surface is divided into 20 surface hit "]
[null,"locations, and the ship volume is divided into 20 internal "]
[null,"explosion locations. The number next to a system name shows how "]
[null,"many damage locations this system covers."]
[]
[null,"For example \"Elec 1.2\" means that ship's electronic systems "]
[null,"cover one internal explosion location and 20% of another. "]
[null,"However, the system may be divided around many hit locations."]
[]
[null,"Example: \"Elec 1.2\" is evenly divided into 6 hit locations "]
[null,"around the ship. A hit into any of these locations has "]
[null,"[1.2/6=0.2] 20% change of damaging electronic systems. A hit "]
[null,"location with 20% electronics and 80& quarters would read:"]
[]
[null,"1-4: Elec, 5-20 Qtrs"]

{"sheet":"Tables","index":1,"n_rows":404,"n_cols":34,"rows_kept":404,"cut":false,"hidden":false,"merged":[]}
["0: Spacecraft hull",null,null,null,null,null,null,null,null,null,null,null,null,null,"Cutter",null,"Unstreamlined","USL"]
[{"$f":"14*Ship!B2","v":67.2},"m3","Ratio","Radius (m)","Area (m2)","Surf Mod","Length","Width","Height","Ref Area","Unstreamlined","Streamlined","Airframed",null,"Gunboat",null,"Streamlined","SL",null,"Size","Rate","Vol","MV",null,"Location","Slope","Armor Mult.","Volume consumed"]
["Sphere",null,null,{"$f":"(A2/(4/3*PI()))^(1/3)","v":2.5220879155938243},{"$f":"4*PI()*D3^2","v":79.933771837820089},1,{"$f":"2*D3","v":5.0441758311876486},{"$f":"G3","v":5.0441758311876486},{"$f":"G3","v":5.0441758311876486},{"$f":"PI()*D3^2","v":19.983442959455022},0.8,0.1,"#Not Available",null,"Monitor",null,"Airframed","AF",null,null,1,14,0.6,null,"Fron/Rear","No Slope",1,0]
[{"$f":"\"Flat-ended Cylinder (\"&C4&\":1)\"","v":"Flat-ended Cylinder (1:1)"},null,1,{"$f":"(A2/(2*PI()*C4))^(1/3)","v":2.2032467334102561},{"$f":"2*PI()*D4^2*(1+2*C4)","v":91.501327083761055},{"$f":"E4/E3","v":1.1447142425533317},{"$f":"2*D4*C4","v":4.4064934668205122},{"$f":"2*D4","v":4.4064934668205122},{"$f":"H4","v":4.4064934668205122},15.250221180626843,0.6,0.8,"#Not Available",null,"Courier",null,null,null,null,null,2,28,0.7,null,"Front/Rear","Moderate Slope",1.5,0.1]
[{"$f":"\"Rounded Cylinder 1 (\"&C5&\":1)\"","v":"Rounded Cylinder 1 (2:1)"},null,2,{"$f":"(A2/(2*PI()*(C5-1/6)))^(1/3)","v":1.8001802387291379},{"$f":"PI()*D5^2*(1+4*C5)","v":91.627188765220566},{"$f":"E5/E3","v":1.1462888170862946},{"$f":"2*D5*C5","v":7.2007209549165516},{"$f":"2*D5","v":3.6003604774582758},{"$f":"H5","v":3.6003604774582758},10.180798751691174,0.7,0.8,1.2,null,"Scout",null,null,null,null,null,3,42,1,null,"Front/Rear","Radical Slope",2,0.2]
[{"$f":"\"Rounded Cylinder 2 (\"&C6&\":1)\"","v":"Rounded Cylinder 2 (4:1)"},null,4,{"$f":"(A2/(2*PI()*(C6-1/3)))^(1/3)","v":1.4288040023454989},{"$f":"4*PI()*D6^2*C6","v":102.61602121599326},{"$f":"E6/E3","v":1.2837630310276591},{"$f":"2*D6*C6","v":11.430432018763991},{"$f":"2*D6","v":2.8576080046909977},{"$f":"H6","v":2.8576080046909977},6.4135013259995786,0.7,0.8,1.2,null,"Close Escort",null,"FFS1 Int. strukt.",null,null,null,4,56,1.3,null,"Sides","No Slope",1,0]
[{"$f":"\"Needle (\"&B7&\":\"&C7&\":1)\"","v":"Needle (2:2:1)"},2,2,{"$f":"(A2/(2*PI()*(B7+C7/3)))^(1/3)","v":1.5888158272710715},{"$f":"PI()*D7^2*(1+4*B7+(1+4*C7^2)^0.5)","v":104.07193083341026},{"$f":"E7/E3","v":1.3019769796997041},{"$f":"2*D7*(B7+C7)","v":12.710526618168572},{"$f":"2*D7","v":3.177631654542143},{"$f":"H7","v":3.177631654542143},7.9304345939463508,0.7,0.8,1.2,null,"Escort",null,"FFS2 Struct. factor",null,null,null,5,70,1.5,null,"Sides","Moderate Slope",1.5,0.2]
[{"$f":"\"Cone (\"&C8&\":1)\"","v":"Cone (3.7:1)"},null,3.7,{"$f":"(A2/(2/3*PI()*C8))^(1/3)","v":2.0544850173488354},{"$f":"PI()*D8^2*(1+SQRT(1+4*C8^2))","v":112.27907387079617},{"$f":"E8/E3","v":1.4046512667837368},{"$f":"2*D8*C8","v":15.203189128381382},{"$f":"2*D8","v":4.1089700346976707},{"$f":"H8","v":4.1089700346976707},13.260375721015812,0.8,0.9,1.1000000000000001,null,"Destroyer",null,"Asteroid hull",null,null,null,6,84,1.8,null,"Sides","Radical Slope",2,0.4]
[{"$f":"\"Disc (\"&C9&\":1)\"","v":"Disc (2:1)"},null,2,{"$f":"(A2*C9/(2*PI()))^(1/3)","v":2.7759169375356993},{"$f":"2*PI()*D9^2*(1+2/C9)","v":96.832868579499049},{"$f":"E9/E3","v":1.2114137285547593},{"$f":"2*D9","v":5.5518338750713987},{"$f":"G9","v":5.5518338750713987},{"$f":"D9/C9","v":1.3879584687678497},{"$f":"H9*I9","v":7.7057148440975753},1.4,1.6,1.2,null,"Frigate",null,null,null,null,null,7,98,2]
[{"$f":"\"Torus (\"&C10&\":1)\"","v":"Torus (8:1)"},null,8,{"$f":"(A2/(2*PI()^2*C10))^(1/3)","v":0.75217087849590603},{"$f":"4*PI()^2*C10*D10^2","v":178.68280179731994},{"$f":"E10/E3","v":2.2353855909596581},{"$f":"(C10+1)*D10","v":6.769537906463154},{"$f":"G10","v":6.769537906463154},{"$f":"2*D10","v":1.5043417569918121},{"$f":"(C10+PI())*D10^2","v":6.3034789406304776},0.6,0.8,1.2,null,"Cruiser",null,null,null,null,null,8,112,2.2000000000000002]
[{"$f":"\"Dome (\"&C11&\":1)\"","v":"Dome (2:1)"},{"$f":"2*ATAN(C11/2)-PI()/2","v":0},2,{"$f":"(A2/(PI()*((1-SIN(B11))^2-(1-SIN(B11))^3/3)))^(1/3)","v":3.1776316545421426},{"$f":"2*PI()*D11*I11 + PI()*D11^2","v":95.165215127356191},{"$f":"E11/E3","v":1.1905507889761491},{"$f":"2*COS(B11)*D11","v":6.3552633090842852},{"$f":"G11","v":6.3552633090842852},{"$f":"D11*(1-SIN(B11))","v":3.1776316545421426},{"$f":"0.5*PI()*D11*I11","v":15.860869187892698},1.4,1.6,1.2,null,"Battleship",null,"Design Rules",null,null,null,9,126,2.5]
[{"$f":"\"Box (\"&B12&\":\"&C12&\":1)\"","v":"Box (10:2.5:1)"},10,2.5,{"$f":"(A2/(B12*C12))^(1/3)","v":1.3904106579545799},{"$f":"2*D12^2*(B12+C12+B12*C12)","v":144.99313483152659},{"$f":"E12/E3","v":1.8139158392989048},{"$f":"D12*B12","v":13.904106579545799},{"$f":"D12*C12","v":3.4760266448864496},{"$f":"D12","v":1.3904106579545799},{"$f":"H12*I12","v":4.8331044943842194},0.4,0.6,"#Not Available",null,"Freighter",null,null,"FFS ",null,null,10,140,2.7]
[{"$f":"\"Ellipsoid (\"&B13&\":\"&C13&\":1)\"","v":"Ellipsoid (3:1.5:1)"},3,1.5,{"$f":"(A2/(4/3*PI()*B13*C13))^(1/3)","v":1.5276459627862085},{"$f":"4*PI()*D13^2*B13*C13","v":131.96774966911201},{"$f":"E13/E3","v":1.6509636244473129},{"$f":"2*D13*B13","v":9.1658757767172503},{"$f":"2*D13*C13","v":4.5829378883586251},{"$f":"2*D13","v":3.0552919255724169},{"$f":"PI()*D13^2*C13","v":10.997312472426001},0.6,0.8,1.2,null,"Liner",null,null,"Twilight ",null,null,{"$f":"Ship!B2","v":4.8},{"$f":"U13*14","v":67.2},{"$f":"(U13-U14)*(W15-W14)+W14","v":1.46}]
[{"$f":"\"Wedge (\"&B14&\":\"&C14&\":1)\"","v":"Wedge (2.25:2:1)"},2.25,2,{"$f":"(A2/(2/3*B14*C14))^(1/3)","v":2.8189194928259562},{"$f":"2*D14^2*SQRT((1+C14^2)*(1+B14^2)) + 2*D14^2*C14","v":119.28485895601534},{"$f":"E14/E3","v":1.4922961373327384},{"$f":"2*D14*B14","v":12.685137717716803},{"$f":"2*D14*C14","v":11.275677971303825},{"$f":"2*D14","v":5.6378389856519124},{"$f":"2*D14^2*C14","v":31.785228428136584},0.5,0.7,1.5,null,"Repair Facility",null,null,null,null,null,{"$f":"ROUNDDOWN(U13,0)","v":4},{"$f":"U14*14","v":56},{"$f":"VLOOKUP(U14,U3:W12,3)","v":1.3},null,"Configuration","Material Mult.","Turret Vol. Mult",null,null,"Tech Level","Turret Mult"]
["Open Frame",null,null,{"$f":"D3","v":2.5220879155938243},{"$f":"2*E3","v":159.86754367564018},2,{"$f":"4*G3","v":20.176703324750594},{"$f":"2*D15*0.5","v":2.5220879155938243},{"$f":"H15","v":2.5220879155938243},{"$f":"H15*I15","v":6.3609274539844014},0.3,"#Not Available","#Not Available",null,"Research Vessel",null,null,null,null,null,{"$f":"ROUNDUP(U13,0)","v":5},{"$f":"U15*14","v":70},{"$f":"VLOOKUP(U15,U3:W12,3)","v":1.5},null,"Open",0.7,1,null,null,0,"N/A"]
["Needle",null,null,null,null,1.3,{"$f":"3*G3","v":15.132527493562947},null,null,null,0.7,0.8,1.2,null,null,null,null,null,null,null,null,null,null,null,"Enclosed",1,1,null,null,4,6]
["Wedge",null,null,null,null,1.5,{"$f":"2.5*G3","v":12.610439577969121},null,null,null,0.5,0.7,1.5,null,null,null,null,null,null,null,null,null,null,null,"Turret",1,{"$f":"VLOOKUP(Ship!$K$144,$AE$15:$AE$20,1)","v":2},null,null,5,5]
["Cylinder",null,null,null,null,1.1000000000000001,{"$f":"2*G3","v":10.088351662375297},null,null,null,0.6,0.8,2,null,null,null,null,null,null,null,null,null,null,null,"Small Turret",1,10,null,null,6,4]
["Box",null,null,null,null,1.2,{"$f":"1.25*G3","v":6.3052197889845605},null,null,null,0.4,0.6,"#Not Available",null,null,null,null,null,null,null,null,null,null,null,null,null,null,null,null,7,3]
["Dome/Disc",null,null,null,null,1.2,{"$f":"1.5*G3","v":7.5662637467814733},null,null,null,1.4,1.6,1.2,null,null,null,null,null,null,null,null,null,null,null,null,null,null,null,null,8,2]
["Close Structure",null,null,{"$f":"D3","v":2.5220879155938243},{"$f":"1.4*E3","v":111.90728057294812},1.4,{"$f":"2*D21*1.75","v":8.8273077045783843},{"$f":"2*1.3*D21","v":6.5574285805439434},{"$f":"2*0.3*D21","v":1.5132527493562946},{"$f":"H21*I21","v":9.9230468282156661},0.3,"#Not Available","#Not Available"]
["Slab",null,null,null,null,1.5,{"$f":"2.75*G3","v":13.871483535766034},null,null,null,0.5,0.7,1.5,null,"Shuttlecraft"]
["Asteroid",null,null,{"$f":"D3","v":2.5220879155938243},79.933771837820089,1,5.0441758311876486,5.0441758311876486,5.0441758311876486,19.983442959455022,null,null,null,null,"Commercial Transport"]
["ACV",null,null,null,null,1.4,{"$f":"G7/G3","v":2.5198420997897459},null,null,null,0.4,0.6,1.5,null,"Troop Transport"]
["Contoured",null,null,null,null,1.44,null,null,null,null,null,null,null,null,"Jump Shuttle"]
["Pseudo-biological",null,null,null,null,1.8,null,null,null,null,null,null,null,null,"Yacht"]
["Vehicle",null,null,null,null,1.4,{"$f":"F27*Ship!B2","v":6.72},{"$f":"1*Ship!B2","v":4.8},{"$f":"1*Ship!B2","v":4.8},null,null,null,null,null,"Multimission Sloop"]
["1: Material technology",null,null,null,null,null,null,null,null,null,null,null,null,null,"System Defense Boat"]
["Tech level","Material","Toughness","Density","Pow (MW)","Price",null,"Material","Toughness","Density","Price"]
[0,"Cured Hides",4.2000000000000003E-2,1.2,0,1E-3,null,"Manufactured hull",0,0,0]
[0,"Light Wood",0.1,0.4,0,2.9999999999999997E-4,null,"Icy Asteroid",0.2,1.1000000000000001,50]
[1,"Wood",0.2,0.8,0,4.0000000000000002E-4,null,"Metallic Asteroid",1.2,8,100]
[3,"Iron",1.5,8,0,1.5E-3,null,"Rocky Asteroid",0.5,5.5,75]
[4,"Soft Steel",1.7,8,0,1.6000000000000001E-3]
[5,"Hard Steel",2,8,0,2E-3]
[6,"Light Alloy",1.7,6,0,4.0000000000000001E-3]
[6,"Fiberglass",0.25,1,0,1E-3]
[6,"Titanium Alloy",3,8,0,0.01]
[7,"Light Composite",4,7,0,7.0000000000000001E-3]
[7,"Aluminium",1,3.2,0,2.3999999999999998E-3]
[7,"Fiberglass",0.25,0.4,0,2.3999999999999998E-3]
[8,"Comp Lam",6,8,0,8.0000000000000002E-3]
[9,"Light Ceramic Composite",5,6,0,8.9999999999999993E-3]
[10,"Cryst Iron",8,10,0,8.9999999999999993E-3]
[12,"Superdense",14,15,0,1.4E-2]
[12,"Advanced Composites",9,11,0,8.0000000000000002E-3]
[14,"Bonded Superdense",28,15,1,2.8000000000000001E-2]
[15,"Enhanced Bonded SD",33,15,1,3.1E-2]
[16,"Collapsed Crystalline",20,13,0,2.1999999999999999E-2]
[17,"Coherent Superdense",40,15,1,3.5000000000000003E-2]
[18,"Enhanced Coherent SD",48,15,1,5.1999999999999998E-2]
[]
["3: Faster than light (FTL) drives"]
[]
[null,"Type","Vol (m3)","Mass (ton)","Pow (MW)","Area (m2)","Price (MCr)",null,null,null,null,null,"Jump Drive",null,"Keyhole Drive",null,"Stargate",null,null,"Subspace Drive"]
[1,"None",0,0,0,0,0,{"$f":"\"\"","v":""},null,null,null,"Tech Level","Max Jump","Mass (ton)","MJ","Vol (m3/)","EPL","GOE","Vol (m3/)","Vol (m3/)","Efficiency"]
[2,"TNE Jump Drive",{"$f":"(Ship!I13+1) * (14*Ship!B2+Ship!B148)/100 * IF(Ship!I13=0,0,1)","v":0},{"$f":"IF(C57=0,0,VLOOKUP(Ship!K13,L57:N64,3) * C57)","v":0},0,{"$f":"C57/3","v":0},{"$f":"0.3*C57","v":0},"Pc Jump",null,null,null,0,0,0,0,0,0,0,0,0,0]
[3,"T4 Jump Drive",{"$f":"(Ship!I13+1) * (14*Ship!B2+Ship!B148)/100 * IF(Ship!I13=0,0,1)","v":0},{"$f":"IF(C58=0,0,VLOOKUP(Ship!K13,L57:N64,3) * C58)","v":0},0,{"$f":"C58/3","v":0},{"$f":"0.3*C58","v":0},"Pc Jump",null,null,null,9,1,3,3,2,0,0,0,0.5,0.6]
[4,"Stutter Warp",{"$f":"2+5*SQRT(E59)","v":2},{"$f":"C59","v":2},{"$f":"Ship!I13","v":0},{"$f":"C59/3","v":0.66666666666666663},{"$f":"0.3*C59","v":0.6},"MW Power",null,{"$f":"(Ship!K13+4)*(E59/(10*Ship!B2))^(1/3)","v":0},"effic",10,1,3,3,2,6,20,1,0.4,0.65]
[5,"Subspace",{"$f":"E60*VLOOKUP(Ship!K13,L57:U67,9)","v":0},{"$f":"C60","v":0},{"$f":"Ship!I13","v":0},{"$f":"C60/3","v":0},{"$f":"C60*0.25","v":0},"MW Power",null,{"$f":"(E60/Ship!B2)*VLOOKUP(Ship!K13,L57:U67,10)*0.1","v":0},"Pc/hour",11,2,3,2.5,1.75,7,18,1,0.3,0.7]
[1,"None",0,0,0,0,0,null,null,null,null,12,3,3,2,1.5,8,16,1,0.25,0.72]
[2,"Keyhole",{"$f":"Ship!I14*VLOOKUP(Ship!K13,L57:P67,5)","v":2.4},{"$f":"C62","v":2.4},0,{"$f":"C62/3","v":0.79999999999999993},{"$f":"0.3*C62","v":0.72},{"$f":"Ship!I14*VLOOKUP(Ship!K13,L57:P67,4)","v":11.2},"MJ GOE",null,null,13,4,3,1.5,1.25,9,14,1,0.2,0.8]
[3,"Stargate",{"$f":"14*Ship!I14*VLOOKUP(Ship!K13,L57:S68,8)","v":89.600000000000009},{"$f":"C63","v":89.600000000000009},{"$f":"Ship!I15*100","v":0},0,{"$f":"2*C63","v":179.20000000000002},{"$f":"Ship!I14*VLOOKUP(Ship!K13,L57:S68,7)","v":96},"MJ GOE",{"$f":"VLOOKUP(Ship!K25,L57:S68,6)","v":0},"Pc EPL",14,5,2.5,1.25,1,10,12,0.9,0.15,0.85]
[1,"None",0,0,0,0,0,null,null,null,null,15,6,2,1,0.75,12,10,0.8,0.1,0.9]
[2,"Jump Fuel",{"$f":"C57*5 * Ship!I16/Ship!I13","v":{"$error":"#DIV/0!"}},{"$f":"0.07*C65","v":{"$error":"#DIV/0!"}},0,0,0,null,null,null,null,16,null,null,0.9,0.5,15,9,0.7,0.08,0.95]
[3,"Jump Fuel",{"$f":"Ship!B2*14/10 * Ship!I16","v":26.880000000000003},{"$f":"0.07*C66","v":1.8816000000000004},0,0,0,null,null,null,null,18,null,null,0.8,0.25,20,8,0.6,0.06,1]
[null,null,null,null,null,null,null,null,null,null,null,20,null,null,0.7,0.15,25,7,0.5,0.04,1.1000000000000001]
[null,null,null,null,null,null,null,null,null,null,null,21,null,null,null,null,30,6,0.4]
[]
["4: Control systems"]
[]
["Tech Lev","Controls","Pow (MW)","Price (MCr)","Workstat",null,"Tech Level","Maint Mod"]
[0,"None",0,0,0,null,4,2]
[4,"Primitive",0,1E-4,1E-4,null,6,3]
[5,"Basic Mec",0,2.0000000000000001E-4,2.0000000000000001E-4,null,8,4]
[6,"Enhanced",2.0000000000000001E-4,2.9999999999999997E-4,2.9999999999999997E-4,null,10,5]
[7,"Electronic",5.0000000000000001E-4,5.0000000000000001E-4,5.0000000000000001E-4,null,13,6]
[8,"Enh Elec",5.0000000000000001E-4,7.5000000000000002E-4,7.5000000000000002E-4,null,16,8]
[9,"Com Link",5.0000000000000001E-4,1E-3,1E-3,null,19,10]
[10,"Dyn Link",1E-3,1.5E-3,1.5E-3,null,22,12]
[13,"Holo Link",1E-3,2E-3,2E-3]
[17,"Syn Link",1E-3,2.5000000000000001E-3,2.5000000000000001E-3]
[21,"Syn Fluid",1E-3,3.0000000000000001E-3,3.0000000000000001E-3]
[]
["Tech Level","Avionics","Vol (m3)","Mass (ton)","Pow (MW)","Price (MCr)",null,"Tech Level","Nav Aid","Vol (m3)","Mass (ton)","Pow (MW)","Price (MCr)"]
[0,"None",0,0,0,0,null,0,"None",0,0,0,0]
[4,"Magnetic compass",1E-4,1E-4,0,1E-3,null,2,"Magnetic compass",1E-4,1E-4,0,1E-3]
[5,"Gyrocompass, barometric altimeter",1E-4,1E-4,0,0.01,null,5,"Gyrocompass",1E-4,1E-4,0,1E-3]
[6,"Radar altimeter, transponder",1E-4,1E-4,0.01,0.05,null,6,"Transponder",1E-4,1E-4,0.01,1E-3]
[7,"Weather radar, FLIR, inertial positioning",1E-3,1E-3,0.1,0.1,null,7,"Inertial positioning",1E-3,1E-3,0.01,0.01]
[8,"Imaging radar",1E-3,1E-3,0.1,0.2,null,8,"Satellite positioning",1E-3,1E-3,0.01,0.02]
[10,"Imaging EMS, inertial/gravitational positioning",1E-3,1E-3,0.1,0.25,null,10,"IGS positioning",1E-3,1E-3,0.01,2.5000000000000001E-2]
[]
["Terr-Foll","Vol (m3)","Mass (ton)","Price (MCr","NOE","Computer","Vol (m3)","Mass (ton)","Pow (MW)","Price (MCr)","Multiplier"]
[0,0,0,0,40,0,0,0,0,0,0,1,"Standard",1,1]
[8,0.2,0.05,0.01,120,5,50,10,0.5,1.5,1,2,"Fibre-optic",2,2]
[9,0.02,0.04,1.0999999999999999E-2,130,6,10,2,0.1,1,0.8,3,"Flight",0.1,1E-3]
[10,0.15,0.04,1.2E-2,140,7,5,1,0.15,0.5,0.7]
[11,0.15,0.03,1.2999999999999999E-2,150,8,5,1,0.2,0.4,0.6]
[12,0.1,0.03,1.4E-2,160,9,5,1,0.25,0.6,0.5]
[13,0.1,0.02,1.4999999999999999E-2,170,10,6,1.2,0.3,1,0.45]
[14,0.05,0.02,1.6E-2,180,11,7,1.4,0.35,2,0.4]
[15,0.05,0.02,1.7000000000000001E-2,190,12,8,1.6,0.4,3,0.35]
[16,0.03,0.03,1.7999999999999999E-2,200,13,9,1.8,0.45,4,0.3]
[17,0.03,0.03,1.9E-2,250,14,8,1.6,0.5,5,0.25]
[18,0.02,0.04,0.02,300,15,7,1.4,0.55000000000000004,6,0.2]
[19,0.02,0.04,2.1999999999999999E-2,350,16,6,1.2,0.6,10,0.15]
[20,0.01,0.05,2.4E-2,400,17,5,1,0.6,11,0.13]
[21,0.01,0.05,2.8000000000000001E-2,450,18,4,0.8,0.6,12,0.11]
[null,null,null,null,null,19,3,0.6,0.55000000000000004,13,0.09]
["None",0,0,0,0,20,2,0.4,0.5,14,7.0000000000000007E-2]
[{"$f":"E112&\" km/h NOE\"","v":"120 km/h NOE"},{"$f":"VLOOKUP(Ship!K30,A95:E109,2)","v":0.2},{"$f":"VLOOKUP(Ship!K30,A95:E109,3)","v":0.05},{"$f":"VLOOKUP(Ship!K30,A95:E109,4)","v":0.01},{"$f":"VLOOKUP(Ship!K30,A95:E109,5)","v":120},21,1,0.2,0.45,15,0.05]
[]
["5A: Electronics, Communicators"]
["LasComm",0,1E-4,1E-3,0.01,0.1,1,10,1000,"MasComm",0,1E-4,1E-3,0.01,0.1,1,10,1000]
[0,0,0,0,0,0,0,0,0,0,0,0,0,0,0,0,0,0]
[8,0,4.0000000000000001E-3,1.6E-2,0.2,0.04,7.0000000000000007E-2,0.11,"N/A",8,0,0.1,0.03,0.04,0.08,0.15,0.2,"N/A"]
[9,0,2E-3,8.0000000000000002E-3,0.1,0.02,3.5000000000000003E-2,5.5E-2,0.12,9,0,5.0000000000000001E-3,1.4999999999999999E-2,0.02,0.04,7.0000000000000007E-2,0.1,0.25]
[10,0,1E-3,6.0000000000000001E-3,8.0000000000000002E-3,1.4999999999999999E-2,2.5000000000000001E-2,0.04,7.0000000000000007E-2,10,0,2E-3,0.01,1.4999999999999999E-2,0.03,0.05,0.08,0.15]
[12,0,1E-3,4.0000000000000001E-3,5.0000000000000001E-3,0.01,1.7999999999999999E-2,2.8000000000000001E-2,0.05,12,0,1E-3,2E-3,0.01,0.02,0.04,0.06,0.1]
[15,0,"N/A",1E-3,2E-3,3.0000000000000001E-3,5.0000000000000001E-3,7.0000000000000001E-3,1.4999999999999999E-2,15,0,"N/A",1E-3,4.0000000000000001E-3,6.0000000000000001E-3,0.01,1.4999999999999999E-2,0.03]
[18,0,"N/A","N/A","N/A",1E-3,2E-3,3.0000000000000001E-3,7.0000000000000001E-3,18,0,"N/A","N/A","N/A",2E-3,4.0000000000000001E-3,6.0000000000000001E-3,1.4999999999999999E-2]
[20,0,"N/A","N/A","N/A","N/A",1E-3,2E-3,5.0000000000000001E-3,20,0,"N/A","N/A","N/A","N/A",2E-3,4.0000000000000001E-3,0.01]
["MCr",0,1.1999999999999999E-3,5.0000000000000001E-3,1.0999999999999999E-2,2.1000000000000001E-2,3.5999999999999997E-2,5.6000000000000001E-2,0.18,"MCr",0,1.1999999999999999E-3,5.0000000000000001E-3,1.0999999999999999E-2,2.1000000000000001E-2,3.5999999999999997E-2,5.6000000000000001E-2,0.18]
["MW",0,5.0000000000000001E-3,0.01,0.02,0.04,0.08,0.15,0.3,"MW",0,0.01,0.02,0.04,0.08,0.15,0.3,0.6]
[]
["Meson",0,0.01,0.1,1,10,1000,"Range","Radio",0,1E-4,1E-3,0.01,0.1,1,10,1000,"Range"]
[0,0,0,0,0,0,0,0,0,0,0,0,0,0,0,0,0,0]
[15,0,0.5,2,30,150,500,0.01,5,0,0.05,0.1,0.15,0.3,0.7,"N/A","N/A",1E-4]
[16,0,0.3,1.5,16,80,220,0.1,6,0,0.01,0.05,0.1,0.15,0.3,0.7,"N/A",1E-3]
[18,0,0.01,0.5,5,25,85,1,7,0,1E-3,0.01,0.05,0.1,0.15,0.3,0.7,0.01]
[20,0,"N/A",0.1,0.2,15,50,10,8,0,1E-4,1E-3,0.01,0.05,0.1,0.15,0.3,0.1]
["MCr",0,0.25,1,2.5,5,20,1000,10,0,1E-4,1E-4,1E-3,0.01,0.05,0.1,0.15,1]
["MW",0,0.05,0.2,1,3,5,null,12,0,1E-4,1E-4,1E-4,1E-3,0.01,0.05,0.1,10]
[null,null,null,null,null,null,null,null,15,0,1E-4,1E-4,1E-4,1E-4,1E-3,0.01,0.05,1000]
[null,null,null,null,null,null,null,null,18,0,1E-4,1E-4,1E-4,1E-4,1E-4,1E-3,0.01]
[null,null,null,null,null,null,null,null,20,0,1E-4,1E-4,1E-4,1E-4,1E-4,1E-4,1E-3]
[null,null,null,null,null,null,null,null,"MCr",0,7.4999999999999993E-5,2.5000000000000001E-4,5.0000000000000001E-4,5.0000000000000001E-3,0.03,0.09,0.15]
[null,null,null,null,null,null,null,null,"MW",0,1E-4,1E-3,0.01,0.1,1,10,20]
[]
["5B: Electronics, Sensors"]
["Active",0,1.0000000000000001E-5,1E-4,1E-3,0.01,0.1,1,2,4,6,8,10,12,14,16,"A Range"]
[0,0,0,0,0,0,0,0,0,0,0,0,0,0,0,0,0]
[5,0,0.3,3,30,300,"N/A","N/A","N/A","N/A","N/A","N/A","N/A","N/A","N/A","N/A",1.0000000000000001E-5]
[6,0,0.1,1,10,100,"N/A","N/A","N/A","N/A","N/A","N/A","N/A","N/A","N/A","N/A",1E-4]
[7,0,0.04,0.4,4,40,400,"N/A","N/A","N/A","N/A","N/A","N/A","N/A","N/A","N/A",1E-3]
[8,0,0.02,0.2,2,20,30,40,50,"N/A","N/A","N/A","N/A","N/A","N/A","N/A",0.01]
[9,0,0.01,0.1,1,10,15,20,30,"N/A","N/A","N/A","N/A","N/A","N/A","N/A",0.1]
[10,0,"N/A",0.2,1,3,7,10,13,16,19,23,26,31,36,42,1]
[11,0,"N/A",0.1,0.8,1.6,3,5,6,8,10,11,12,15,17,20,2]
[12,0,"N/A",0.1,0.6,1,1.6,2.2000000000000002,2.5,3.3,4,4.8,5.5,7,8.5,10,4]
[14,0,"N/A",0.1,0.5,0.8,1,1.2,1.4,1.8,2.2000000000000002,2.6,3,3.4,4.2,5,6]
[16,0,"N/A",0.1,0.4,0.6,0.8,1,1.2,1.4,1.6,1.8,2,2.2000000000000002,2.4,2.6,8]
[18,0,"N/A",0.1,0.3,0.4,0.6,0.8,0.9,1.1000000000000001,1.2,1.4,1.5,1.7,1.8,1.9,10]
[20,0,"N/A",0.1,0.2,0.3,0.4,0.5,0.6,0.7,0.8,0.9,1,1.1000000000000001,1.2,1.3,12]
[null,null,null,null,null,null,null,null,null,null,null,null,null,null,null,null,14]
["Ladar",0,1E-4,1E-3,0.01,0.1,1,2,4,6,8,10,"L Range",null,"Tech Level","Ant Area",16]
[0,0,0,0,0,0,0,0,0,0,0,0,0,null,0,0]
[8,0,0.1,0.4,0.8,2,5,"N/A","N/A","N/A","N/A","N/A",1E-4,null,5,10]
[9,0,0.01,0.04,0.08,0.2,0.5,1,2.4,"N/A","N/A","N/A",1E-3,null,6,6]
[11,0,5.0000000000000001E-3,0.02,0.04,0.1,0.2,0.5,1.2,2.5,"N/A","N/A",0.01,null,7,4]
[13,0,1E-3,4.0000000000000001E-3,8.0000000000000002E-3,2E-3,0.04,0.1,0.24,0.5,1.2,2.5,0.1,null,8,1]
[15,0,"N/A","N/A",2E-3,5.0000000000000001E-3,0.01,2.5000000000000001E-2,0.06,0.12,0.25,0.6,1,null,9,0.5]
[16,0,"N/A","N/A","N/A",2E-3,4.0000000000000001E-3,0.01,0.02,0.05,0.1,0.2,2,null,10,1]
[18,0,"N/A","N/A","N/A","N/A",2E-3,4.0000000000000001E-3,5.0000000000000001E-3,0.01,2.5000000000000001E-2,0.04,4,null,11,0.5]
[20,0,"N/A","N/A","N/A","N/A","N/A",2E-3,3.0000000000000001E-3,5.0000000000000001E-3,6.0000000000000001E-3,0.01,6,null,12,0.25]
[null,null,null,null,null,null,null,null,null,null,null,null,8,null,13,0.125]
[null,null,null,null,null,null,null,null,null,null,null,null,10,null,14,7.4999999999999997E-2]
["Densitom","Pow (MW)","Vol (m3)","Mass (ton)","Price (MCr)","Neurino","Vol (m3)","MCr","NAS","Mass","Pow (MW)","MCr","Range",null,15,2.5000000000000001E-2]
[0,0,0,0,0,0,0,0,0,0,0,0,0,null,16,0.01]
[11,2.5,30,10,0.75,10,100,1,13,5.0000000000000001E-3,4.0000000000000001E-3,0.02,5.0000000000000001E-3]
[12,1,15,5,0.9,12,10,2,14,5.0000000000000001E-3,5.0000000000000001E-3,0.02,2.5000000000000001E-2]
[13,0.9,12,3,0.95,14,5,3,15,5.0000000000000001E-3,6.0000000000000001E-3,0.02,0.05]
[14,0.5,9,2,1,16,2,4,16,5.0000000000000001E-3,7.0000000000000001E-3,0.02,0.5]
[15,0.4,7,1.5,1.5,18,1,5,18,4.0000000000000001E-3,8.9999999999999993E-3,2.5000000000000001E-2,5]
[16,0.3,4,1,1.5,null,null,null,20,3.0000000000000001E-3,0.01,0.03,50]
[18,0.2,2,0.8,1.5]
[20,0.1,1,0.7,1.5]
[]
["Passive",0,1.0000000000000001E-5,1E-4,1E-3,0.01,0.1,1,2,3,4,5,6,7,8,"P Range",null,"Lidar","Area mod","m3/m2","Targets"]
[0,0,0,0,0,0,0,0,0,0,0,0,0,0,0,0,null,0,0,0,0]
[7,0,6.0000000000000001E-3,0.06,0.3,0.6,1.5,"N/A","N/A","N/A","N/A","N/A","N/A","N/A","N/A",1.0000000000000001E-5,null,8,{"$f":"10/3","v":3.3333333333333335},10,10]
[8,0,3.0000000000000001E-3,0.03,0.15,0.3,0.6,1.5,3,5,6,7,8,9,10,1E-4,null,9,{"$f":"25/3","v":8.3333333333333339},5,10]
[9,0,1E-3,0.01,0.05,0.1,0.3,0.6,1.5,2.5,3,2.5,4,2.5,5,1E-3,null,10,{"$f":"50/3","v":16.666666666666668},4,20]
[10,0,"N/A",0.03,0.1,0.2,0.3,0.6,1.5,2,2.5,3,3.5,4,4.5,0.01,null,12,{"$f":"100/3.6","v":27.777777777777779},3,40]
[11,0,"N/A",0.02,0.08,0.1,0.2,0.4,1,1.5,2,2.5,3,3.5,4,0.1,null,14,{"$f":"100/3","v":33.333333333333336},2,60]
[12,0,"N/A",0.01,0.04,0.08,0.1,0.3,0.6,1,1.5,2,2.5,3,3.5,1,null,16,{"$f":"125/3","v":41.666666666666664},1,80]
[14,0,"N/A",5.0000000000000001E-3,0.02,0.04,0.08,0.2,0.4,0.6,1,1.5,2,2.5,3,2]
[16,0,"N/A",3.0000000000000001E-3,0.01,0.02,0.04,0.1,0.3,0.4,0.6,1,1.5,2,2.5,3]
[18,0,"N/A",2E-3,5.0000000000000001E-3,0.01,0.02,0.08,0.2,0.3,0.4,0.6,1,1.5,2,4]
[20,0,"N/A",1E-3,2E-3,5.0000000000000001E-3,0.01,0.04,0.1,0.2,0.3,0.4,0.6,1,1.5,5]
["AD",0,0.25,0.5,1,2.25,3.5,5,10,20,40,90,200,400,800,6]
["AA",0,0.05,0.2,1,4,10,20,80,300,1200,6000,30000,125000,500000,7]
["AD",0,"N/A",0.25,0.5,1,2.25,3.5,5,10,20,40,90,200,400,8]
["AA",0,"N/A",0.02,0.08,0.4,1.6,4,8,32,120,480,2400,12000,50000]
[]
["5C: Electronics, Electronic countermeasures"]
["Area Jam","Vol (m3)","Pow (MW)",null,null,"Type","Vol (m3)","Mass (ton)","Pow (MW)","Area (m2)","Price (MCr)"]
[10,0.32,2E-3,null,1,"None",0,0,0,0,0]
[11,0.3,1E-3,null,2,"Stealth Surface",0.5,0.1,0,0,0.05]
[12,0.4,4.4999999999999999E-4,null,3,"EM Masking",0.28000000000000003,0.14000000000000001,1.4E-2,0.14000000000000001,7.0000000000000007E-2]
[14,0.375,3.6000000000000002E-4]
[16,0.42,2.7E-4]
[18,0.375,1.8000000000000001E-4]
[20,0.4,9.0000000000000006E-5]
[]
["6: Defensive systems"]
["N Damper","Vol (m3)","Pow (MW)","Price(MCr)","Min Vol","Meson Sc","TLM","Size Code","TSM"]
[0,0,0,0,0,12,50,0,1]
[12,5,5.0000000000000001E-4,0.13,7.5,13,60,1,1]
[13,8,2.9999999999999997E-4,0.3,7.2,14,70,2,1]
[14,10,2.0000000000000001E-4,0.67,6,15,80,3,2]
[15,11,1E-4,0.15,3.3,16,90,4,4]
[16,13,8.0000000000000007E-5,2,3.12,17,100,5,8]
[18,13,6.0000000000000002E-5,4,2.88,18,105,6,16]
[20,16,3.0000000000000001E-5,6,1.62,19,110]
[null,null,null,null,null,20,115]
[null,null,null,null,null,21,120]
[]
["7: Optional features"]
["Fuel Purification Plant",null,null,null,null,null,null,"Vehicle Service Facilities"]
["Tech Level","Vol (m3)","Mass (ton)","Pow (MW)","Price (MCr)","Min Vol",null,"Type","Service","Vol (mult)","Mass (ton)","Pow (MW)","Price (MCr)","Bays"]
[0,0,0,0,0,0,null,1,"none",0,0,0,0,0]
[8,0.7,1.5,0.01,2.0000000000000001E-4,135,null,2,"minimal hangar",2,0.2,0,2.0000000000000001E-4,20]
[9,0.6,1.2,8.9999999999999993E-3,1.9000000000000001E-4,120,null,3,"spacious hangar",4,0.2,0,2.0000000000000001E-4,25]
[10,0.55000000000000004,1.1000000000000001,8.0000000000000002E-3,1.8000000000000001E-4,105,null,4,"docking ring",1,0,0,2.0000000000000001E-4,40]
[11,0.45,0.9,7.0000000000000001E-3,1.7000000000000001E-4,95,null,5,"launch tube",25,0.5,0.01,1.4999999999999999E-4,50]
[12,0.4,0.8,6.0000000000000001E-3,1.6000000000000001E-4,80,null,6,"USL grapple",0.1,1,0,1E-3,100]
[13,0.35,0.7,5.0000000000000001E-3,1.4999999999999999E-4,65,null,7,"SL grapple",0.3,1,0,2E-3,200]
[14,0.25,0.5,5.0000000000000001E-3,1.3999999999999999E-4,55,null,8,"AF grapple",0.5,1,0,3.0000000000000001E-3,400]
[15,0.2,0.4,5.0000000000000001E-3,1.4999999999999999E-4,40]
[16,0.15,0.3,5.0000000000000001E-3,1.6000000000000001E-4,25,null,"Seats"]
[17,0.1,0.2,5.0000000000000001E-3,1.7000000000000001E-4,15,null,"Type","Seat","Vol (m3)","Mass (ton)","Price (MCr)"]
[18,0.05,0.1,5.0000000000000001E-3,1.8000000000000001E-4,5,null,1,"none",0,0,0]
[null,null,null,null,null,null,null,2,"restricted",1.5,0.02,1E-4]
[null,null,null,null,null,null,null,3,"cramped",2.5,0.02,1E-4]
[null,null,null,null,null,null,null,4,"adequate",3.5,0.02,1E-4]
[null,null,null,null,null,null,null,5,"roomy",7,0.02,1E-4]
[]
["8: Power production"]
["Available Power Plants",null,null,null,null,null,null,null,null,"Fuel Cells",null,null,null,null,null,null,null,null,"Homopolar Generator",null,null,"Batteries","MWh/m3","t/m3","MCr(m3",null,"Available Power Plants"]
[null,"Descript","MW/m3","Density","Price/m3","Min Vol","Fuel cons","Fuel Type",null,"Tech Level","Descript","MW/m3","Density","Price/m3","Min Vol","Fuel cons","Fuel Type",null,0,0,null,0,0,0,0,null,null,"Descript","MW/m3","Density","Price/m3","Min Vol","Fuel cons","Fuel Type"]
[1,{"$f":"VLOOKUP(Ship!$K$25,$J$243:$Q$247,2)","v":"Fuel Cell"},{"$f":"VLOOKUP(Ship!$K$25,$J$243:$Q$247,3)","v":0.5},{"$f":"VLOOKUP(Ship!$K$25,$J$243:$Q$247,4)","v":1},{"$f":"VLOOKUP(Ship!$K$25,$J$243:$Q$247,5)","v":0.02},{"$f":"VLOOKUP(Ship!$K$25,$J$243:$Q$247,6)","v":0.01},{"$f":"VLOOKUP(Ship!$K$25,$J$243:$Q$247,7)","v":0.3},{"$f":"VLOOKUP(Ship!$K$25,$J$243:$Q$247,8)","v":6},null,0,"N/A",0,0,0,0,0,1,null,7,0.25,null,4,0.04,2,1E-3,null,1,{"$f":"VLOOKUP(Ship!$K$25,$J$243:$Q$247,2)","v":"Fuel Cell"},{"$f":"VLOOKUP(Ship!$K$25,$J$243:$Q$247,3)","v":0.5},{"$f":"VLOOKUP(Ship!$K$25,$J$243:$Q$247,4)","v":1},{"$f":"VLOOKUP(Ship!$K$25,$J$243:$Q$247,5)","v":0.02},{"$f":"VLOOKUP(Ship!$K$25,$J$243:$Q$247,6)","v":0.01},{"$f":"VLOOKUP(Ship!$K$25,$J$243:$Q$247,7)","v":0.3},{"$f":"VLOOKUP(Ship!$K$25,$J$243:$Q$247,8)","v":6}]
[2,{"$f":"VLOOKUP(Ship!$K$25,$A$251:$H$254,2)","v":"Fission"},{"$f":"VLOOKUP(Ship!$K$25,$A$251:$H$254,3)","v":1},{"$f":"VLOOKUP(Ship!$K$5,$A$251:$H$254,4)","v":0},{"$f":"VLOOKUP(Ship!$K$25,$A$251:$H$254,5)","v":0.1},{"$f":"VLOOKUP(Ship!$K$25,$A$251:$H$254,6)","v":10},{"$f":"VLOOKUP(Ship!$K$25,$A$251:$H$254,7)/(365*24)","v":1.1415525114155251E-5},{"$f":"VLOOKUP(Ship!$K$25,$A$251:$H$254,8)","v":11},null,7,"Fuel Cell",0.5,1,0.02,0.01,0.3,6,null,8,0.125,null,5,0.06,2,1E-3,null,2,{"$f":"VLOOKUP(Ship!$K$25,$A$251:$H$254,2)","v":"Fission"},{"$f":"VLOOKUP(Ship!$K$25,$A$251:$H$254,3)","v":1},{"$f":"VLOOKUP(Ship!$K$5,$A$251:$H$254,4)","v":0},{"$f":"VLOOKUP(Ship!$K$25,$A$251:$H$254,5)","v":0.1},{"$f":"VLOOKUP(Ship!$K$25,$A$251:$H$254,6)","v":10},{"$f":"VLOOKUP(Ship!$K$25,$A$251:$H$254,7)/(365*24)","v":1.1415525114155251E-5},{"$f":"VLOOKUP(Ship!$K$25,$A$251:$H$254,8)","v":11}]
[3,{"$f":"VLOOKUP(Ship!$K$25,$A$255:$H$263,2)","v":"N/A"},{"$f":"VLOOKUP(Ship!$K$25,$A$255:$H$263,3)","v":0},{"$f":"VLOOKUP(Ship!$K$25,$A$255:$H$263,4)","v":0},{"$f":"VLOOKUP(Ship!$K$25,$A$255:$H$263,5)","v":0},{"$f":"VLOOKUP(Ship!$K$25,$A$255:$H$263,6)","v":0},{"$f":"VLOOKUP(Ship!$K$25,$A$255:$H$263,7)/(365*24)","v":0},{"$f":"VLOOKUP(Ship!$K$25,$A$255:$H$263,8)","v":1},null,12,"Fuel Cell",0.75,1,0.02,0.01,0.25,6,null,9,0.1,null,6,0.08,2,8.0000000000000004E-4,null,3,{"$f":"VLOOKUP(Ship!$K$25,$A$255:$H$263,2)","v":"N/A"},{"$f":"VLOOKUP(Ship!$K$25,$A$255:$H$263,3)","v":0},{"$f":"VLOOKUP(Ship!$K$25,$A$255:$H$263,4)","v":0},{"$f":"VLOOKUP(Ship!$K$25,$A$255:$H$263,5)","v":0},{"$f":"VLOOKUP(Ship!$K$25,$A$255:$H$263,6)","v":0},{"$f":"VLOOKUP(Ship!$K$25,$A$255:$H$263,7)/(365*24)","v":0},{"$f":"VLOOKUP(Ship!$K$25,$A$255:$H$263,8)","v":1}]
[4,{"$f":"VLOOKUP(Ship!$K$25,$A$267:$H$272,2)","v":"N/A"},{"$f":"VLOOKUP(Ship!$K$25,$A$267:$H$272,3)","v":0},{"$f":"VLOOKUP(Ship!$K$25,$A$267:$H$272,4)","v":0},{"$f":"VLOOKUP(Ship!$K$25,$A$267:$H$272,5)","v":0},{"$f":"VLOOKUP(Ship!$K$25,$A$267:$H$272,6)","v":0},{"$f":"VLOOKUP(Ship!$K$25,$A$267:$H$272,7)/(365*24)","v":0},{"$f":"VLOOKUP(Ship!$K$25,$A$267:$H$272,8)","v":1},null,14,"Fuel Cell",1.5,1,0.02,0.01,0.2,6,null,10,0.08,null,7,0.1,2,8.0000000000000004E-4,null,4,{"$f":"VLOOKUP(Ship!$K$25,$A$267:$H$272,2)","v":"N/A"},{"$f":"VLOOKUP(Ship!$K$25,$A$267:$H$272,3)","v":0},{"$f":"VLOOKUP(Ship!$K$25,$A$267:$H$272,4)","v":0},{"$f":"VLOOKUP(Ship!$K$25,$A$267:$H$272,5)","v":0},{"$f":"VLOOKUP(Ship!$K$25,$A$267:$H$272,6)","v":0},{"$f":"VLOOKUP(Ship!$K$25,$A$267:$H$272,7)/(365*24)","v":0},{"$f":"VLOOKUP(Ship!$K$25,$A$267:$H$272,8)","v":1}]
[5,{"$f":"VLOOKUP(Ship!$K$25,$J$251:$Q$259,2)","v":"N/A"},{"$f":"VLOOKUP(Ship!$K$25,$J$251:$Q$259,3)","v":0},{"$f":"VLOOKUP(Ship!$K$25,$J$251:$Q$259,4)","v":0},{"$f":"VLOOKUP(Ship!$K$25,$J$251:$Q$259,5)","v":0},{"$f":"VLOOKUP(Ship!$K$25,$J$251:$Q$259,6)","v":0},{"$f":"VLOOKUP(Ship!$K$25,$J$251:$Q$259,7)","v":0},{"$f":"VLOOKUP(Ship!$K$25,$J$251:$Q$259,8)","v":1},null,16,"Fuel Cell",1.75,1,0.02,0.01,0.2,6,null,11,0.06,null,8,0.2,2,1E-3,null,5,{"$f":"VLOOKUP(Ship!$K$25,$J$251:$Q$259,2)","v":"N/A"},{"$f":"VLOOKUP(Ship!$K$25,$J$251:$Q$259,3)","v":0},{"$f":"VLOOKUP(Ship!$K$25,$J$251:$Q$259,4)","v":0},{"$f":"VLOOKUP(Ship!$K$25,$J$251:$Q$259,5)","v":0},{"$f":"VLOOKUP(Ship!$K$25,$J$251:$Q$259,6)","v":0},{"$f":"VLOOKUP(Ship!$K$25,$J$251:$Q$259,7)","v":0},{"$f":"VLOOKUP(Ship!$K$25,$J$251:$Q$259,8)","v":1}]
[null,null,null,null,null,null,null,null,null,null,null,null,null,null,null,null,null,null,12,0.05,null,9,0.4,2,2E-3,null,6,{"$f":"IF(Ship!K25<3,\"N/A\",\"Early Steam\")","v":"Early Steam"},0.1,2,5.0000000000000001E-4,0.25,0.2,{"$f":"INDEX($J$261:$J$273,Ship!$M$26)","v":10}]
["Nuclear Power Plants",null,null,null,null,null,null,null,null,"Piezo-Nuclear Fusion (PNF) Power Plants",null,null,null,null,null,null,null,null,13,4.4999999999999998E-2,null,10,0.8,2,3.0000000000000001E-3,null,7,{"$f":"IF(Ship!$K$25<4,\"N/A\",\"Steam\")","v":"Steam"},0.2,2,5.0000000000000001E-4,0.15,0.15,{"$f":"INDEX($J$261:$J$273,Ship!$M$26)","v":10}]
["Tech Level","Descript","MW/m3","Density","Price/m3","Min Vol","Fuel cons","Fuel Type",null,"Tech Level","Descript","MW/m3","Density","Price/m3","Min Vol","Fuel cons","Fuel Type",null,14,0.04,null,11,1,2,4.0000000000000001E-3,null,8,{"$f":"IF(Ship!$K$25<4,\"N/A\",\"Int. Comb.\")","v":"Int. Comb."},0.3,1,1E-3,0.05,0.2,{"$f":"INDEX($J$261:$J$273,Ship!$M$26)","v":10}]
[0,"N/A",0,0,0,0,0,1,null,0,"N/A",0,0,0,0,0,1,null,15,3.5000000000000003E-2,null,12,1.5,2,5.0000000000000001E-3,null,9,{"$f":"IF(Ship!$K$25<5,\"N/A\",\"Steam Turbine\")","v":"Steam Turbine"},0.35,2,2E-3,1,0.15,{"$f":"INDEX($J$261:$J$273,Ship!$M$26)","v":10}]
[6,"Fission",0.3,10,0.1,30,0.75,11,null,9,"PNF",0.4,1,5.0000000000000001E-3,0,2E-3,13,null,16,0.03,null,13,2,2.5,8.0000000000000002E-3,null,10,{"$f":"IF(Ship!$K$25<5,\"N/A\",\"Improved Int. Comb.\")","v":"Improved Int. Comb."},0.4,1,2E-3,0.01,0.25,{"$f":"INDEX($J$261:$J$273,Ship!$M$26)","v":10}]
[7,"Fission",0.6,8,0.1,20,0.25,11,null,10,"PNF",0.5,1,5.0000000000000001E-3,0,2E-3,13,null,17,2.5000000000000001E-2,null,14,2.5,2.5,0.01,null,11,{"$f":"IF(Ship!$K$25<7,\"N/A\",\"Gas Turbine\")","v":"Gas Turbine"},0.5,1,5.0000000000000001E-3,0.5,0.3,{"$f":"INDEX($J$261:$J$273,Ship!$M$26)","v":10}]
[8,"Fission",1,6,0.1,10,0.1,11,null,11,"PNF",0.6,1,5.0000000000000001E-3,0,2E-3,13,null,18,0.02,null,15,3,2.5,1.4999999999999999E-2,null,12,{"$f":"IF(Ship!$K$25<8,\"N/A\",\"MHD Turbine\")","v":"MHD Turbine"},0.6,1,0.01,1,0.2,{"$f":"INDEX($J$261:$J$273,Ship!$M$26)","v":10}]
[0,"N/A",0,0,0,0,0,1,null,12,"PNF",0.8,1,5.0000000000000001E-3,0,2E-3,13,null,19,1.4999999999999999E-2,null,16,3.5,2.5,0.02]
[9,"Fusion",2,4,0.2,{"$f":"IF(Ship!G13=1,1000,100)","v":1000},0.15,10,null,13,"PNF",1,1,5.0000000000000001E-3,0,2E-3,13,null,20,0.01,null,17,4,2.5,2.5000000000000001E-2]
[10,"Fusion",2,4,0.2,{"$f":"IF(Ship!G13=1,500,50)","v":500},0.15,10,null,14,"PNF",1.25,1,5.0000000000000001E-3,0,2E-3,13,null,21,5.0000000000000001E-3,null,18,6,3,0.03]
[11,"Fusion",2,4,0.2,{"$f":"IF(Ship!G13=1,200,20)","v":200},0.15,10,null,15,"PNF",1.5,1,5.0000000000000001E-3,0,2E-3,13,null,null,null,null,19,8,4,0.04]
[12,"Fusion",2,4,0.2,10,0.15,10,null,16,"PNF",2,1,5.0000000000000001E-3,0,2E-3,13,null,null,null,null,20,10,5,0.05]
[13,"Fusion",3,3,0.2,1,0.1,10,null,null,null,null,null,null,null,null,null,null,null,null,null,21,12,6,0.1]
[14,"Fusion",3,3,0.2,0.25,0.1,10,null,1,"None",0]
[15,"Fusion",6,2,0.2,0.1,0.1,10,null,2,"Wood",2]
[16,"Fusion",7,1,0.2,7.4999999999999997E-2,0.1,10,null,3,"Alchohol",1]
[null,null,null,null,null,null,null,null,null,4,"Coal",2]
["MAA (Matter-Antimatter Annihilation) Power Plants",null,null,null,null,null,null,null,null,5,"HCD",1]
["Tech Level","Descript","MW/m3","Density","Price/m3","Min Vol","Fuel cons","Fuel Type",null,6,"HGHCD",1]
[0,"N/A",0,0,0,0,0,1,null,7,"LRF",1]
[17,"Antimatter",50,6,0.5,8,5.0000000000000001E-3,12,null,8,"SRF",1]
[18,"Antimatter",100,5,0.5,1,2E-3,12,null,9,"HRF",0.3]
[19,"Antimatter",250,4,0.5,0.25,1E-3,12,null,10,"LHyd",7.0000000000000007E-2]
[20,"Antimatter",500,3,0.5,0.1,5.0000000000000001E-4,12,null,11,"Radioactive",19]
[21,"Antimatter",1000,2,0.5,0.02,2.0000000000000001E-4,12,null,12,"Antimatter",7.0000000000000007E-2]
[null,null,null,null,null,null,null,null,null,13,"Water",1]
[3,"Primitive External Combustion",0.1]
[4,"External Combustion",0.2]
[4,"Primitive Internal Combustion",0.25]
[5,"Advanced External Combustion"]
[]
[]
[]
[]
[]
[]
["9: Sublight (maneuver) drives"]
[]
["Tech Level","Type","kN/m3",{"$f":"\"t/m3\"","v":"t/m3"},"MW/m3","m2/m3","MCr/m3","Thrust Fac","m3/kN/hr","Fuel","Min Vol"]
[0,"None",0,0,0,0,0,0,0,1]
[9,"Standard AG",333.33300000000003,1.266,0.6,0.6,4.0000000000000001E-3,0.08,0,1]
[10,"Improved AG",500,1,0.7,1,8.0000000000000002E-3,0.12,0,1]
[12,"High Efficiency AG",500,0.65,0.35,1,0.01,0.16,0,1]
[8,"AZHRAE",90,1,0,0.09,0.5,1,{"$f":"4.5/0.3","v":15},9]
[9,"Fusion Rocket",90,1,-0.18,4.4999999999999998E-2,0.35,1,3.5000000000000001E-3,10]
[10,"HEPlaR",2000,1,10,1,0.01,1,1.25E-3,10,0.1]
[11,"Thruster Plates",400,2,1,0.04,0.25,1,0,1,10]
[]
[null,"Lifter","m3/Td","t/Td","MW/Td","MCr/Td"]
[0,"None",0,0,0,0]
[9,"Standard CG",0.5,0.4,0.3,0.02,null,6,"Air Cushion",4.2,0.84,0.1,4.1999999999999997E-3]
[10,"Improved CG",0.3,0.3,0.2,2.5000000000000001E-2]
[12,"High-Efficiency CG",0.3,0.2,0.1,0.03]
[null,null,null,null,null,null,null,null,null,null,null,null,null,null,null,"Suspension",null,"m3/m3","t/m3","SA","MCr/m3"]
["Suspension",null,"m3/m3","t/m3","SA","MCr/m3",null,"Transmission","Track Vol","Wheel Vol","Price (Cr)",null,null,null,null,0,"None",0,0,0,0]
[0,"None",0,0,0,0,null,0,0,0,0,null,null,null,null,4,"Restricted Wheel",0.15,0.2,0.3,2.5000000000000001E-4]
[4,"Restricted Wheel",0.15,0.2,0.3,2.5000000000000001E-4,null,4,5,3,1000,null,null,null,null,5,"Restricted Wheel",0.1,0.2,0.3,2.5000000000000001E-4]
[5,"Restricted Wheel",0.1,0.2,0.3,2.5000000000000001E-4,null,6,2,1,1250,null,null,null,null,5,"Wheel",0.15,0.2,0.3,2.5000000000000001E-4]
[5,"Wheel",0.15,0.2,0.3,2.5000000000000001E-4,null,7,0.5,0.3,1500,null,null,null,null,5,"Cross Country Wheel",0.2,0.2,0.4,2.5000000000000001E-4]
[5,"Cross Country Wheel",0.2,0.2,0.4,2.5000000000000001E-4,null,null,null,null,null,null,null,null,null,5,"Track",0.2,1.5,0.5,5.0000000000000001E-4]
[5,"Track",0.2,{"$f":"IF(Ship!M4>1,1.25,1.5)","v":1.25},0.5,5.0000000000000001E-4,null,"Transmission","Leg Vol","Price",null,{"$f":"Ship!K22","v":8},"Vol (m3)","Price",null,8,"Walker",0.2,1,0.2,1E-3]
[8,"Walker",0.2,1,0.2,1E-3,null,0,0,0,null,"None",0,0,null,12,"Non-Grav. Imp. Walker",0.15,1,0.2,2E-3]
[12,"Non-Grav. Imp. Walker",0.15,1,0.2,2E-3,null,8,8,10000,null,"Tracks",{"$f":"VLOOKUP(L308,H303:K306,2)","v":0.5},{"$f":"VLOOKUP(L308,H303:K306,4)","v":1500},null,12,"Improved Walker",0.1,1,0.2,4.0000000000000001E-3]
[12,"Improved Walker",0.1,1,0.2,4.0000000000000001E-3,null,9,2,2500,null,"Wheel",{"$f":"VLOOKUP(L308,H303:K306,3)","v":0.3},{"$f":"N310","v":1500},null,16,"Advanced Walker",0.05,1,0.2,1.6E-2]
[16,"Advanced Walker",0.05,1,0.2,1.6E-2,null,10,0.4,675,null,"Walker",{"$f":"VLOOKUP(L308,H309:J312,2)","v":8},{"$f":"VLOOKUP(L308,H309:J312,3)","v":10000}]
[]
[]
["Ducted Fan","kN/m3","MCr/m3",null,"Propeller","kN/m3","MCr/m3","m3/kN/hr",null,null,"Type","Thrust","Price","FC"]
[0,0,0,null,0,0,0,0,null,0,"None",0,0,0,null,"None",0,0,0]
[8,20,0.5,null,4,2.5,1.2E-2,0.06,null,5,"Turbojet",30,0.15,0.5,null,"Ramjet",60,0.25,2.5]
[10,30,0.4,null,5,5.6,3.2000000000000001E-2,3.5999999999999997E-2,null,6,"Turbojet",36,0.15,0.25,null,"Ramjet",75,0.3,2]
[12,40,0.3,null,6,6.4,0.04,3.1E-2,null,7,"Turbofan",39,0.17499999999999999,0.12]
[14,50,0.2,null,7,7.2,0.04,2.8000000000000001E-2]
[null,null,null,null,8,8,0.04,2.5000000000000001E-2]
[]
[null,"Type","Thrust/m3","ton/m3","MW/m3","Area","MCr/m3","Fuel Cons","Fuel Type"]
[0,"None",0,0,0,null,0,0,1]
[{"$f":"Ship!#REF!","v":{"$error":"#REF!"}},"Ducted Fan",{"$f":"VLOOKUP(Ship!#REF!,A316:C320,2)","v":{"$error":"#REF!"}},1,2,null,{"$f":"VLOOKUP(Ship!#REF!,A316:C320,3)","v":{"$error":"#REF!"}},0,1]
[{"$f":"Ship!#REF!","v":{"$error":"#REF!"}},"Propeller",{"$f":"VLOOKUP(Ship!#REF!,Tables!E316:H321,2)","v":{"$error":"#REF!"}},1,0,null,{"$f":"VLOOKUP(Ship!#REF!,Tables!E316:H321,3)","v":{"$error":"#REF!"}},{"$f":"VLOOKUP(Ship!#REF!,Tables!E316:H321,4)","v":{"$error":"#REF!"}},5]
[{"$f":"VLOOKUP(Ship!#REF!,J316:N319,1)","v":{"$error":"#REF!"}},{"$f":"VLOOKUP(Ship!#REF!,J316:N319,2)","v":{"$error":"#REF!"}},{"$f":"VLOOKUP(Ship!#REF!,J316:N319,3)","v":{"$error":"#REF!"}},1,0,null,{"$f":"VLOOKUP(Ship!#REF!,J316:N319,4)","v":{"$error":"#REF!"}},{"$f":"VLOOKUP(Ship!#REF!,J316:N319,5)","v":{"$error":"#REF!"}},5]
[8,"HBT",30,1,0,null,6.25E-2,0.1,5]
[5,"Light MTR",400,1,5,null,0.02,0,1]
[6,"MTR",320,1,4,null,0.01,0,1]
[6,"Twin Main",300,1,3,null,1.4999999999999999E-2,0,1]
[6,"Coaxial",400,1,4,null,0.02,0,1]
[9,"Lift Activator Disk",90,1,0.5,null,0.01,0,1]
[9,"X-Wing",400,1,4,null,0.05,0,1]
[9,"Ornithopter",333.33300000000003,1,6.6660000000000004,null,0.05,0,1]
[12,"Ornithopter",600,1,10,null,0.03,0,1]
[]
[]
[]
[]
[]
[]
["11: Life support"]
[]
["Life Supp.","Vol (m3)","Mass (ton)","Pow (MW)","Price (MCr)",null,null,null,"Vol","Mass","Pow","Price"]
["None",0,0,0,0,null,null,"None",0,0,0,0,null,"None",null,"6 hours or less",null,"None"]
["Oxy. Tanks & Masks",0.01,1,0,0.01,null,null,"Spun Hull",0,0,0,0,null,"Hatch",null,"16 hours or less",null,"Normal"]
["Overpressure",1E-3,1,0,0.1,null,null,"Double Hull",0.01,1,0,0.1,null,"Air Lock",null,"round-the-clock",null,"Open"]
["Basic",5.0000000000000001E-3,1,0.02,0.06,null,null,"Hamster Cage",0.01,1,0,0.1,null,null,null,null,null,"Cramped"]
["Extended",8.0000000000000002E-3,1,2.5000000000000001E-2,6.25E-2,null,null,"Spin Capsule",0.02,1,0,0.1,null,null,null,null,null,"External"]
[null,null,null,null,null,null,null,"Two Body",0,0,0,0]
["Accomm.","Vol (m3)","Mass (ton)","Pow (MW)","Price (MCr)","Max Cap",null,{"$f":"IF(Ship!K93<10,\"N/A\",\"Artifical Grav/CG\")","v":"Artifical Grav/CG"},0.01,2,0.5,0.05]
["Bunk",14,0.5,0,5.0000000000000001E-3,1]
["Low Berth",14,1,1E-3,0.05,1,null,null,null,"Mod FFS","T4",null,null,null,"FFS","FFS Mod","T4",{"$f":"Ship!H32/INDEX(Ship!P121:P123,Ship!G28)","v":0.19999999999999998}]
["Em. Low",28,2,2E-3,0.1,4,null,"Full",null,{"$f":"FLOOR(Ship!B13/30*Ship!H32,1)","v":0},{"$f":"ROUND(Crew(Ship!B13)*Ship!H32,2)","v":{"$error":"#NAME?"}},{"$f":"IF(K355<0.2,0,CEILING(K355,1))","v":{"$error":"#NAME?"}},"Jump Drive engineers",null,{"$f":"IF(Ship!G13=1,1,2)","v":1},{"$f":"O355","v":1},{"$f":"MAX(Ship!F4,CEILING(3*IF(LOG(Tables!R354*Ship!B2/10)<0,0,LOG(Tables!R354*Ship!B2/10)),1))","v":1},"Manouver"]
["S Stateroom",28,2,5.0000000000000001E-4,0.04,2,null,"Reduced",null,{"$f":"FLOOR((Ship!B20+Ship!B21)/30*Ship!H32,1)","v":0},{"$f":"ROUND(Crew(Ship!B20)*Ship!H32,2)","v":{"$error":"#NAME?"}},{"$f":"IF(K356<0.2,0,CEILING(K356,1))","v":{"$error":"#NAME?"}},"Manouver drive engineers",null,{"$f":"FLOOR(SUM(Ship!I35:I46) * Ship!H32,1)","v":1},{"$f":"J363","v":1},{"$f":"FLOOR(R354*SUM(Ship!I35:'Ship'!I54),1)","v":0},"Electronics",null,{"$f":"R354*SUM(Ship!I35:'Ship'!I54)","v":0.6}]
["L Stateroom",56,4,1E-3,0.1,4,null,"Minimal",null,{"$f":"FLOOR(Ship!B25/30*Ship!H32,1)","v":0},{"$f":"ROUND(Crew(Ship!B25)*Ship!H32,2)","v":{"$error":"#NAME?"}},{"$f":"IF(K357<0.2,0,CEILING(K357,1))","v":{"$error":"#NAME?"}},"Power plant engineers",null,{"$f":"FLOOR((Ship!D25)/30 * Ship!H32,1)","v":0},{"$f":"J358","v":0},{"$f":"FLOOR(R354*(Ship!D25/30+(SUM(Ship!C13:'Ship'!C15)+SUM(Ship!C20:'Ship'!C19))/60),1)","v":0},"Engineers",null,{"$f":"R354*(Ship!D25/30+(SUM(Ship!C13:'Ship'!C15)+SUM(Ship!C20:'Ship'!C19))/60)","v":1.9715555555555552E-2}]
["S Crew Bay",70,5,2E-3,0.14000000000000001,8,null,"Original FFS",null,{"$f":"SUM(J355:J357)","v":0},{"$f":"SUM(K355:K357)","v":{"$error":"#NAME?"}},{"$f":"SUM(L355:L357)","v":{"$error":"#NAME?"}},"Engineers",null,{"$f":"FLOOR(((SUM(Ship!C127:C136)+Ship!C140) * 0.1 *Ship!H32)/50,1)","v":0},{"$f":"O358","v":0},{"$f":"MAX(0,FLOOR(R354*(SUM(Ship!C13:'Ship'!C15)+SUM(Ship!C20:'Ship'!C19)+Ship!C25+SUM(Ship!C130:'Ship'!C136)+Ship!C140)/500,1) - FLOOR(Q361/6,1))","v":0},"Maintenance",null,{"$f":"MAX(0,R354*(SUM(Ship!C13:'Ship'!C15)+SUM(Ship!C20:'Ship'!C19)+Ship!C25+SUM(Ship!C130:'Ship'!C136)+Ship!C140)/500 - FLOOR(Q361/6,1))","v":4.2329040000000009E-3}]
["L Crew Bay",140,10,4.0000000000000001E-3,0.28000000000000003,16,null,"Modifed FFS",null,{"$f":"K359","v":1.2},{"$f":"SUM(Ship!I35:I38)*Ship!H32","v":1.2},{"$f":"IF(K359<0.2,0,CEILING(K359,1))","v":2},"Communication operators",null,{"$f":"Q359","v":0},{"$f":"Q359","v":0},{"$f":"SUM(Ship!K61:'Ship'!K66)+Ship!I72+Ship!I69+Ship!I70","v":0},"Gunnery"]
[null,null,null,null,null,null,null,"FFS2",null,{"$f":"K360","v":0.6},{"$f":"SUM(Ship!I40:I46)*Ship!H32","v":0.6},{"$f":"IF(K360<0.2,0,CEILING(K360,1))","v":1},"Sensor operators",null,{"$f":"Q360","v":0},{"$f":"Q360","v":0},{"$f":"Ship!I132","v":0},"Flight Crew"]
[null,null,null,null,null,null,null,null,null,{"$f":"K361","v":0},{"$f":"SUM(Ship!I52:I54)*Ship!H32","v":0},{"$f":"IF(K361<0.2,0,CEILING(K361,1))","v":0},"ECM operators",null,{"$f":"Q361","v":0},{"$f":"Q361","v":0},{"$f":"Ship!I133","v":0},"Ships Troops"]
["14: Fire control",null,null,null,null,null,null,null,null,{"$f":"SUM(Ship!I69:I70)*Ship!H32","v":0},{"$f":"ROUND(Crew(Ship!B69+Ship!B70)*Ship!H32,2)","v":{"$error":"#NAME?"}},{"$f":"IF(K362<0.2,0,CEILING(K362,1))","v":{"$error":"#NAME?"}},"Screen operators",null,{"$f":"FLOOR(SUM(O355:O361)/6,1)","v":0},{"$f":"FLOOR(SUM(P355:P360)/6+P361/30,1)","v":0},{"$f":"FLOOR(SUM(Q355:Q360)/6,1)","v":0},"Command"]
[null,null,null,null,null,null,1.0000000000000001E-5,null,null,{"$f":"FLOOR(SUM(J359:J362),1)","v":1},{"$f":"SUM(K359:K362)","v":{"$error":"#NAME?"}},{"$f":"SUM(L359:L362)","v":{"$error":"#NAME?"}},"Electronics",null,{"$f":"Q363","v":0},{"$f":"Q363","v":0},{"$f":"Ship!I135","v":0},"Scientist"]
["MFD","Vol (m3)","Diff Mod",null,null,null,1E-4,null,null,null,null,null,null,null,{"$f":"FLOOR((O362+Ship!I107)/8 + (SUM(O355:O361)+Ship!I106)/50 * Ship!H32,1)","v":0},{"$f":"FLOOR((P362+Ship!I107)/8 + (SUM(P355:P361)+Ship!I106)/50 * Ship!H32,1)","v":0},{"$f":"MAX(IF(Ship!I107=0,0,1),FLOOR((Q362+Ship!I107)/8+(Ship!I106+SUM(Q355:Q361))/50,1))","v":0},"Stewards",null,{"$f":"(Q362+Ship!I107)/8+(Ship!I106+SUM(Q355:Q361))/50","v":0.02}]
[0,0,0,null,"Laser",null,1E-3,null,null,null,null,null,null,null,{"$f":"FLOOR((SUM(O355:O364)+Ship!I106+Ship!I107)/120 + Ship!I105/20,1)","v":0},{"$f":"FLOOR((SUM(P355:P364)+Ship!I106+Ship!I107)/120 + Ship!I105/20,1)","v":0},{"$f":"FLOOR((SUM(Q355:Q364)+Ship!I106+Ship!I107)/120 + (Ship!I105+Q367)/20,1)","v":0},"Medics",null,{"$f":"(SUM(Q355:Q364)+Ship!I106+Ship!I107)/120 + (Ship!I105+Q367)/20","v":8.3333333333333332E-3}]
[8,6,1,null,"Maser",null,0.01,null,null,null,null,null,null,null,null,null,{"$f":"FLOOR(IF(T356<1,T356,0)+IF(T357<1,T357,0)+IF(T358<1,T358,0)+IF(T364<1,T364,0)+IF(T365<1,T365,0),1)","v":0},"Multipurpose Crew"]
[9,3,2,null,null,null,0.1,null,null,null,null,null,null,null,null,null,{"$f":"Ship!I138","v":0},"Frozen Watch"]
[10,2.4,3,null,null,null,1]
[12,2,4,null,null,null,2]
[14,1.2,5,null,null,null,3]
[15,0.6,6,null,null,null,4]
[17,0.3,7,null,null,null,5]
[19,0.15,8,null,null,null,6]
[null,null,null,null,null,null,7]
[null,null,null,null,null,null,8]
[1,null,null,null,null,null,9]
[2,null,null,null,null,null,10]
[3]
[4]
[5]
[6]
[7]
[8]
[9]
[10,null,null,null,null,null,null,null,null,null,null,null,{"$f":"\"16:1/6-20\"","v":"16:1/6-20"},{"$f":"\"32:1/3-10\"","v":"32:1/3-10"}]
[null,null,null,null,null,null,null,null,null,null,null,null,{"$f":"\"40:1/2-7\"","v":"40:1/2-7"},{"$f":"\"80:1-4\"","v":"80:1-4"}]
["Configuration",null,null,null,null,null,null,null,null,null,null,null,{"$f":"\"40:500\"","v":"40:500"},{"$f":"\"80:250\"","v":"80:250"}]
[null,null,null,null,null,null,null,null,null,null,null,null,{"$f":"\"24:100\"","v":"24:100"},{"$f":"\"48:50\"","v":"48:50"}]
[null,null,null,null,null,null,null,null,null,null,null,null,{"$f":"\"10:1/10-30\"","v":"10:1/10-30"},{"$f":"\"10:1/10-30\"","v":"10:1/10-30"},"X-ray Grav, 4 MW"]
[null,null,null,null,null,null,null,null,null,null,null,null,{"$f":"\"40:1/14-45\"","v":"40:1/14-45"},{"$f":"\"80:1/14-45\"","v":"80:1/14-45"},{"$f":"\"X-ray Grav, 9 MW\"","v":"X-ray Grav, 9 MW"}]
[]
[]
["Size","Rate","Vol","MV"]
[null,0,0,0]
[null,1,14,0.6]
[null,2,28,0.7]
[null,3,42,1]
[null,4,56,1.3]
[null,5,70,1.5]
[null,6,84,1.8]
[null,7,98,2]
[null,8,112,2.2000000000000002]
[null,9,126,2.5]
[null,10,140,2.7]

{"sheet":"Ship","index":2,"n_rows":166,"n_cols":17,"rows_kept":166,"cut":false,"hidden":false,"merged":[]}
["Tech Level",{"$f":"IF(K143=K144,K143,K143&\"/\"&K144)","v":"8/14"},null,null,null,null,null,null,null,null,null,{"$f":"ROUND((B2*7)^(1/3)*2.1,2)","v":6.78},"m length",{"$f":"140*B2*F5*I20","v":0},"kN"]
["Hull Size",4.8,"TD"," ","Name","M1A5",null,null,null,null,null,{"$f":"ROUND((B2*7)^(1/3),2)","v":3.23},"m width",{"$f":"140*B2*F5*I21","v":0},"kN"]
["Hull Shape",25,null," ","Type",24,null,null,{"$f":"INDEX(Tables!$V$3:$V$13,B2)","v":56},null,null,{"$f":"ROUND((B2*7)^(1/3)*IF(B5<2,0.7,0.9),2)","v":2.9},"m height"]
["Streamline",1,null,null,"Duration",1,null,null,null,null,null,null,2]
["Config",3,null,null,"Density",1,"ton/m3"]
[null,null,null,null,null,{"$f":"ROUND(C150/(14*B2),4)","v":0.93189999999999995},"ton/m3 actual density",null,null," ",null,{"$f":"SUM(C9:C17)","v":42.906133333333337},"tons armor"]
[]
["Hull","Vol (m3)","Mass (ton)","Pow (MW)","Area (m2)","Price (MCr)"]
["Hull Shell",{"$f":"Tables!$W$13*L9*IF(I9=0,0,1)","v":0},{"$f":"B9*INDEX(Tables!$D$30:$D$51,$G$9)","v":0},{"$f":"B9*INDEX(Tables!$E$30:$E$51,$G$9)","v":0},{"$f":"INDEX(Tables!E3:E27,B3)*IF(B4=3,1.3,1)","v":0},{"$f":"C9*INDEX(Tables!$F$30:$F$51,$G$9)","v":0},13,null,0,null,null,{"$f":"I9/INDEX(Tables!$C$30:$C$51,$G$9)","v":0},"cm base armor thickness"]
["Front",{"$f":"Tables!$W$13*L10*IF(I10=0,0,1)*0.1","v":2.5988000000000002},{"$f":"B10*INDEX(Tables!$D$30:$D$51,$G$9)","v":20.790400000000002},{"$f":"B10*INDEX(Tables!$E$30:$E$51,$G$9)","v":0},null,{"$f":"C10*INDEX(Tables!$F$30:$F$51,$G$9)","v":0.1663232}," ",null,{"$f":"((0.33*160)+(0.67*240))/2","v":106.80000000000001}," ",null,{"$f":"I10/INDEX(Tables!$C$30:$C$51,$G$9)","v":17.8},"cm additional armor thickness"]
[null,{"$f":"INDEX(Tables!$AB$3:$AB$5,G11)*I3","v":11.200000000000001},null,null,null,null,3,null,null,"Front AV",{"$f":"($I$9+I10)*INDEX(Tables!$AA$3:$AA$5,G11)","v":213.60000000000002}]
["Sides",{"$f":"Tables!$W$13*L12*IF(I12=0,0,1)*0.3","v":1.9418},{"$f":"B12*INDEX(Tables!$D$30:$D$51,$G$9)","v":15.5344},{"$f":"B12*INDEX(Tables!$E$30:$E$51,$G$9)","v":0},null,{"$f":"C12*INDEX(Tables!$F$30:$F$51,$G$9)","v":0.1242752},null,null,{"$f":"(40*0.33)+(20*0.67)","v":26.6},null,null,{"$f":"I12/INDEX(Tables!$C$30:$C$51,$G$9)","v":4.4333333333333336},"cm additional armor thickness"]
[null,{"$f":"INDEX(Tables!$AB$6:$AB$8,G13)*I3","v":0},null,null,null,null,1,null,null,"Side AV",{"$f":"(I9+I12)*INDEX(Tables!$AA$3:$AA$5,G13)","v":26.6},null,{"$f":"IF(I16>2,\"; J\"&I16-2&\": \"&ROUND((B22+B23+B16*(1-(I16-2)/I16))/(B22/I22),1),\"\")","v":{"$error":"#DIV/0!"}}]
["Rear",{"$f":"Tables!$W$13*L14*IF(I14=0,0,1)*0.1","v":0.38933333333333331},{"$f":"B14*INDEX(Tables!$D$30:$D$51,$G$9)","v":3.1146666666666665},{"$f":"B14*INDEX(Tables!$E$30:$E$51,$G$9)","v":0},null,{"$f":"C14*INDEX(Tables!$F$30:$F$51,$G$9)","v":2.4917333333333333E-2},null,null,{"$f":"(16*0.67+16*0.33)","v":16},null,null,{"$f":"I14/INDEX(Tables!$C$30:$C$51,$G$9)","v":2.6666666666666665},"cm additional armor thickness"]
[null,{"$f":"INDEX(Tables!$AB$3:$AB$5,G15)*I3","v":0},null,null,null,null,1,null,null,"Rear AV",{"$f":"($I$9+I14)*INDEX(Tables!$AA$3:$AA$5,G15)","v":16},null,{"$f":"IF(I16>4,\"; J\"&I16-4&\": \"&ROUND((B22+B23+B16*(1-(I16-4)/I16))/(B22/I22),1),\"\")","v":""}]
["Top",{"$f":"INDEX(Tables!$W$3:$W$13,$B$2)*L16*IF(I16=0,0,1)*0.25","v":0.21666666666666667},{"$f":"B16*INDEX(Tables!$D$30:$D$51,$G$9)","v":1.7333333333333334},{"$f":"B16*INDEX(Tables!$E$30:$E$51,$G$9)","v":0},null,{"$f":"C16*INDEX(Tables!$F$30:$F$51,$G$9)","v":1.3866666666666668E-2},null,null,4,"Top AV",{"$f":"($I$9+I16)","v":4},{"$f":"I16/INDEX(Tables!$C$30:$C$51,$G$9)","v":0.66666666666666663},"cm additional armor thickness"]
["Belly",{"$f":"INDEX(Tables!$W$3:$W$13,$B$2)*L17*IF(I17=0,0,1)*0.25","v":0.21666666666666667},{"$f":"B17*INDEX(Tables!$D$30:$D$51,$G$9)","v":1.7333333333333334},{"$f":"B17*INDEX(Tables!$E$30:$E$51,$G$9)","v":0},null,{"$f":"C17*INDEX(Tables!$F$30:$F$51,$G$9)","v":1.3866666666666668E-2},null,null,4,"Belly AV",{"$f":"I9+I17","v":4},{"$f":"I17/INDEX(Tables!$C$30:$C$51,$G$9)","v":0.66666666666666663},"cm additional armor thickness"]
["Suspension",null,"Mass (ton)","Pow (MW)","Area (m2)","Price (MCr)",null,null,null,null,null,null,{"$f":"IF(I13>1,\"; \",\"\")&IF(I13>0,ROUND((B16+B22+B23)/(B22/I22),1)&\" using \"&IF(I13>1,\"all \",\"\")&\"jump fuel\",\"\")","v":""}]
["Lifter",{"$f":"B2*INDEX(Tables!C297:C300,G19)","v":0},{"$f":"B2*INDEX(Tables!D297:D300,G19)","v":0},{"$f":"B2*INDEX(Tables!E297:E300,G19)","v":0},{"$f":"IF(G19=1,0,0.1*E9)","v":0},{"$f":"B2*INDEX(Tables!F297:F300,G19)","v":0},1,null,null,null,8,null,{"$f":"IF(G19=1,\"\",\", \"&INDEX(Tables!B297:B300,G19)&\" Lifter (\"&D19&\" MW)\")","v":""}]
["Main Drive",{"$f":"IF(G20=1,0,N1/INDEX(Tables!C287:C294,G20))","v":0},{"$f":"B20*INDEX(Tables!D287:D294,G20)","v":0},{"$f":"B20*INDEX(Tables!E287:E294,G20)","v":0},{"$f":"B20*INDEX(Tables!F287:F294,G20)","v":0},{"$f":"B20*INDEX(Tables!G287:G294,G20)","v":0},1,null,0,{"$f":"IF(INDEX(Tables!A287:A294,G20)>K19,\"Error: Not Available\",\"G main\")","v":"G main"},null,null,{"$f":"IF(G20=1,\"\",ROUND(I20,2)&\"G \"&INDEX(Tables!B287:B294,G20)&\" (\"&ROUND(D20/I20,2)&\" MW/G)\")","v":""}]
["Fuel",0,0,0,0,0,null,null,null,null,null,null,{"$f":"IF(OR(G21=1,N2=0),\"\",\", Auxiliary \"&ROUND(I21,2)&\"G \"&INDEX(Tables!B287:B294,G21)&IF(D21>0,\" (\"&ROUND(D21/I21,2)&\" MW/G)\",\"\"))","v":""}]
["Suspension",{"$f":"INDEX(Tables!C303:C312,G22)*B2*14","v":13.44},{"$f":"INDEX(Tables!D303:D312,G22)*B22","v":16.8},0,{"$f":"INDEX(Tables!E303:E312,G22)*B2*14","v":33.6},{"$f":"INDEX(Tables!F303:F312,G22)*B22","v":6.7200000000000003E-3},6,null,null,null,8]
["Transmission",{"$f":"IF(G22<6,Tables!M311,IF(G22>6,Tables!M312,Tables!M310))*D25","v":0.7},{"$f":"B23","v":0.7},0,0,null,null,null,null,null," "]
["Power Plant",null,"Mass (ton)","Pow (MW)","Area (m2)","Price (MCr)"]
["Power Pla",{"$f":"IF(G26=1,PPvol(D25,INDEX(Tables!AC243:AC254,G25),INDEX(Tables!AF243:AF254,G25)),D25/INDEX(Tables!AC243:AC254,G25))","v":2.3333333333333335},{"$f":"B25*INDEX(Tables!AD243:AD254,G25)","v":2.3333333333333335},1.4,0,{"$f":"B25*INDEX(Tables!AE243:AE254,G25)","v":2.3333333333333334E-2},12,null,{"$f":"IF(B25<INDEX(Tables!F243:F247,G25),\"Error: \",\"\")&INDEX(Tables!F243:F247,G25)&\" m3 min volume\"","v":{"$error":"#REF!"}},null,8,null,{"$f":"\"Power Plant: \"&ROUND(D25,1)&\" MW \"&VLOOKUP(G25,Tables!A243:H247,2)&\" Power Plant, \"&I26&\" hour duration (\"&ROUND(B26,1)&\" m3 fuel)\"","v":"Power Plant: 1.4 MW N/A Power Plant, 12 hour duration (3.4 m3 fuel)"}]
["Fuel Tank",{"$f":"$D$25*$I$26*INDEX(Tables!$AG$243:$AG$254,$G$25)","v":3.3599999999999994},{"$f":"B26*INDEX(Tables!L261:L273,INDEX(Tables!AH243:AH254,G25))","v":0.23519999999999999},0,0,0,2,null,12,"hours fuel",null,"Fuel",10]
["Control Systems",null,"Mass (ton)","Pow (MW)","Area (m2)","Price (MCr)",null,null,{"$f":"365*24","v":8760},"hour",null,null,{"$f":"I26/((G117-10)/10)","v":{"$error":"#DIV/0!"}},"hours fuel for amphib operation"]
["Controls",{"$f":"B2 * 0.014*INDEX(Q121:Q123,G28)","v":6.7199999999999996E-2},{"$f":"B28*0.1*INDEX(Q121:Q123,G28)","v":6.7200000000000003E-3},{"$f":"B2 * VLOOKUP(K32,Tables!A74:D83,3)*INDEX(Q121:Q123,G28)","v":2.3999999999999998E-3},0,{"$f":"B2 * VLOOKUP(K32,Tables!A74:D83,4)*INDEX(Q121:Q123,G28)","v":3.5999999999999999E-3},2,null,{"$f":" VLOOKUP(K32,Tables!A74:D83,2)","v":"Enh Elec"},null," ",null,{"$f":"B26/(INDEX(Tables!$AG$243:$AG$254,$G$25)*D144)","v":16.673283048828896},"hours fuel for engine"]
["Avionics",{"$f":"INDEX(Tables!C86:C92,G29)","v":0},{"$f":"INDEX(Tables!D86:D92,G29)","v":0},{"$f":"INDEX(Tables!E86:E92,G29)","v":0},0,{"$f":"INDEX(Tables!F86:F92,G29)","v":0},1,null,{"$f":"IF(INDEX(Tables!A86:A92,G29)>K29,\"Error: Not Available\",\"\")","v":""},null,8,null,{"$f":"IF(G29=1,\"\",INDEX(Tables!B86:B92,G29))","v":""},{"$f":"B26*1000/M28","v":201.52},"liters/hour fuel consumption"]
["Terr Foll",{"$f":"INDEX(Tables!B111:B112,G30)","v":0},{"$f":"INDEX(Tables!C111:C112,G30)","v":0},{"$f":"C30","v":0},{"$f":"10*C30","v":0},{"$f":"INDEX(Tables!D111:D112,G30)","v":0},1,null,null,null,8,null,{"$f":"IF(G30=1,\"\",\", \"&INDEX(Tables!A111:A112,G30))","v":""}]
["Nav Aid",{"$f":"INDEX(Tables!J86:J92,G31)","v":1E-3},{"$f":"INDEX(Tables!K86:K92,G31)","v":1E-3},{"$f":"INDEX(Tables!L86:L92,G31)","v":0.01},0,{"$f":"INDEX(Tables!M86:M92,G31)","v":0.02},6,null,{"$f":"IF(INDEX(Tables!H86:H92,G31)>K31,\"Error: Not Available\",\"\")","v":""},null,8,null,{"$f":"IF(OR(G31=1,G29>=G31),\"\",\", \"&INDEX(Tables!I86:I92,G31))","v":", Satellite positioning"}]
["Main Comp",{"$f":"VLOOKUP(K32,Tables!F99:K112,2) * VLOOKUP(G32,Tables!L95:O97,3)*I32","v":0},{"$f":"VLOOKUP(K32,Tables!F99:K112,3) * VLOOKUP(G32,Tables!L95:O97,3)*I32","v":0},{"$f":"VLOOKUP(K32,Tables!F99:K112,4) * VLOOKUP(G32,Tables!L95:O97,3)*I32","v":0},0,{"$f":"VLOOKUP(K32,Tables!F99:K112,5) * VLOOKUP(G32,Tables!L95:O97,4)*I32","v":0},1,{"$f":"VLOOKUP(K32,Tables!F95:K111,6)","v":0.6},0,"Units",8,null,{"$f":"IF(I32=0,\"\",IF(I32<2,\"\",I32&\"x\")&\"TL-\"&K32&\" \"&INDEX(Tables!M95:M97,Ship!G32)&\" computer (\"&D32/I32&\" MW)\")","v":""}]
["Aux Comp",{"$f":"VLOOKUP(K32,Tables!F99:K112,2) * VLOOKUP(G33,Tables!L95:O97,3) * I33","v":0},{"$f":"VLOOKUP(K32,Tables!F99:K112,3) * VLOOKUP(G33,Tables!L95:O97,3) * I33","v":0},{"$f":"VLOOKUP(K32,Tables!F99:K112,4) * VLOOKUP(G33,Tables!L95:O97,3) * I33","v":0},0,{"$f":"VLOOKUP(K32,Tables!F99:K112,5) * VLOOKUP(G33,Tables!L95:O97,4) * I33","v":0},1,null,0,"Units",null,null,{"$f":"IF(I33=0,\"\",IF(I33<2,\"\",I33&\"x\")&\"TL-\"&K32&\" \"&INDEX(Tables!M95:M97,Ship!G33)&\" computer (\"&D33/I33&\" MW)\")","v":""}]
["Communicators",null,"Mass (ton)","Pow (MW)","Area (m2)","Price (MCr)"]
["Laser",{"$f":"VLOOKUP(K35,Tables!A117:I123,H35+1)*I35","v":1.6E-2},{"$f":"2*B35","v":3.2000000000000001E-2},{"$f":"INDEX(Tables!B125:I125,H35) * I35","v":0.01},{"$f":"IF(H35=1,0,1)*I35","v":1},{"$f":"INDEX(Tables!B124:I124,H35) * I35","v":5.0000000000000001E-3},{"$f":"CHOOSE(H35,\"None\",\"3 km\",\"30 km\",\"300 km\",\"3000 km\",\"1 hex\",\"10 hex\",\"1000 AU\")","v":"30 km"},3,1,"Units",8,null,{"$f":"IF(OR(H35=1,I35=0),\"\",IF(I35<2,\"\",I35&\"x\")&\"Laser (\"&G35&\"; \"&D35/I35&\" MW)\")","v":"Laser (30 km; 0.01 MW)"}]
["Maser",{"$f":"VLOOKUP(K36,Tables!J117:R123,H36+1)*I36","v":0},{"$f":"2*B36","v":0},{"$f":"INDEX(Tables!K125:R125,H36) * I36","v":0},{"$f":"IF(H36=1,0,1)*I36","v":0},{"$f":"INDEX(Tables!K124:R124,H36) * I36","v":0},{"$f":"CHOOSE(H36,\"None\",\"3 km\",\"30 km\",\"300 km\",\"3000 km\",\"1 hex\",\"10 hex\",\"1000 AU\")","v":"None"},1,0,"Units",8,null,{"$f":"IF(OR(H36=1,I36=0),\"\",IF(I36<2,\"\",I36&\"x\")&\"Maser (\"&G36&\"; \"&D36/I36&\" MW)\")","v":""}]
["Meson",{"$f":"VLOOKUP(K37,Tables!A128:G132,1+H37)*I37","v":0},{"$f":"2*B37","v":0},{"$f":"INDEX(Tables!B134:G134,H37)*I37","v":0},{"$f":"MAX(1,10*D37)*IF(H37=1,0,1)*IF(I37=0,0,1)","v":0},{"$f":"INDEX(Tables!B133:G133,H37) * I37","v":0},{"$f":"CHOOSE(H37,\"None\",\"300 km\",\"3000 km\",\"1 hex\",\"10 hex\",\"1000 AU\")","v":"None"},1,0,"Units",8,null,{"$f":"IF(OR(H37=1,I37=0),\"\",IF(I37<2,\"\",I37&\"x\")&\"Meson (\"&G37&\";\"&D37/I37&\" MW)\")","v":""}]
["Radio",{"$f":"VLOOKUP(K38,Tables!I128:Q137,H38+1)*I38","v":0.01},{"$f":"2*B38","v":0.02},{"$f":"INDEX(Tables!J139:Q139,H38)*I38","v":0.01},{"$f":"10*D38","v":0.1},{"$f":"INDEX(Tables!J138:Q138,H38)*I38","v":5.0000000000000001E-4},{"$f":"CHOOSE(H38,\"None\",\"3 km\",\"30 km\",\"300 km\",\"3000 km\",\"1 hex\",\"10 hex\",\"1000 AU\")","v":"300 km"},4,1,"Units",8,null,{"$f":"IF(OR(H38=1,I38=0),\"\",IF(I38<2,\"\",I38&\"x\")&\"Radio (\"&G38&\"; \"&D38/I38&\" MW)\")","v":"Radio (300 km; 0.01 MW)"}]
["Sensors","Vol (m3)","Mass (ton)","Pow (MW)","Area (m2)","Price (MCr)"]
[{"$f":"IF(K40<10,\"Radar\",\"AEMS\")","v":"Radar"},{"$f":"VLOOKUP(K40,Tables!A143:P155,(H40+1))*I40","v":0},{"$f":"2*B40","v":0},{"$f":"5*B40","v":0},{"$f":"IF(K40<10,VLOOKUP(K40,Tables!O158:P170,2),2)*B40","v":0},{"$f":"IF(K40<10,1,2)*B40","v":0},{"$f":"CHOOSE(H40,\"None\",\"300 m\",\"3 km\",\"30 km\",\"300 km\",\"3000 km\",\"1 hex\",\"2 hex\",\"4 hex\",\"6 hex\",\"8 hex\",\"10 hex\",\"12 hex\",\"14 hex\",\"16 hex\")","v":"None"},1,0,"Units",8,null,{"$f":"IF(OR(H40=1,I40=0),\"\",IF(I40<2,\"\",I40&\"x\")&A40&\" (\"&G40&\"; \"&D40/I40&\" MW)\")&IF(OR(H41=1,I41=0),\"\",\", \"&IF(I41<2,\"\",I41&\"x\")&A41&\" (\"&G41&\"; \"&D41/I41&\" MW)\")","v":""}]
[{"$f":"IF(K40<10,\"Radar\",\"AEMS\")","v":"Radar"},{"$f":"VLOOKUP(K40,Tables!A143:P155,(H41+1))*I41","v":0},{"$f":"2*B41","v":0},{"$f":"5*B41","v":0},{"$f":"IF(K40<10,VLOOKUP(K40,Tables!O158:P170,2),2)*B41","v":0},{"$f":"IF(K40<10,1,2)*B41","v":0},{"$f":"CHOOSE(H41,\"None\",\"300 m\",\"3 km\",\"30 km\",\"300 km\",\"3000 km\",\"1 hex\",\"2 hex\",\"4 hex\",\"6 hex\",\"8 hex\",\"10 hex\",\"12 hex\",\"14 hex\",\"16 hex\")","v":"None"},1,0,"Units"]
[{"$f":"IF(K42<10,\"HRT\",\"PEMS\")","v":"HRT"},{"$f":"VLOOKUP(K42,Tables!A181:O191,(H42+1))*I42","v":0},{"$f":"2*B42","v":0},{"$f":"0.1*B42","v":0},0,{"$f":"2*B42","v":0},{"$f":"CHOOSE(H42,\"None\",\"300 m\",\"3 km\",\"30 km\",\"300 km\",\"3000 km\",\"1 hex\",\"2 hex\",\"3 hex\",\"4 hex\",\"5 hex\",\"6 hex\",\"7 hex\",\"8 hex\")","v":"None"},1,1,"Units",8,null,{"$f":"IF(OR(H42=1,I42=0),\"\",IF(I42<2,\"\",I42&\"x\")&A42&IF(H44=\"Folding\",\" Folding array\",\"\")&\" (\"&INDEX(Tables!P181:P194,H42)&\" hex\"&\"; \"&D42/I42&\" MW)\")&IF(OR(H43=1,I43=0),\"\",\", \"&IF(I43<2,\"\",I43&\"x\")&A42&IF(H45=\"Folding\",\" Folding array\",\"\")&\" (\"&INDEX(Tables!P181:P194,H43)&\" hex\"&\"; \"&D43/I43&\" MW)\")","v":""}]
[{"$f":"IF(K42<10,\"HRT\",\"PEMS\")","v":"HRT"},{"$f":"VLOOKUP(K42,Tables!A181:O191,(H43+1))*I43","v":0},{"$f":"2*B43","v":0},{"$f":"0.1*B43","v":0},0,{"$f":"2*B43","v":0},{"$f":"CHOOSE(H43,\"None\",\"300 m\",\"3 km\",\"30 km\",\"300 km\",\"3000 km\",\"1 hex\",\"2 hex\",\"3 hex\",\"4 hex\",\"5 hex\",\"6 hex\",\"7 hex\",\"8 hex\")","v":"None"},1,0,"Units"]
[{"$f":"IF(K42<10,\"HRT Ant\",\"PEMS Ant\")","v":"HRT Ant"},{"$f":"IF(H44=\"Fixed\",0.05,0.1)*E44","v":0},{"$f":"B44","v":0},0,{"$f":"IF(K42<10,INDEX(Tables!B193:O193,H42),INDEX(Tables!B195:O195,H42))*VLOOKUP(K42,Tables!O158:P170,2)*I42","v":0},{"$f":"B44","v":0},{"$f":"I42&\"x\"&IF(K42<10,INDEX(Tables!B192:O192,H42),INDEX(Tables!B194:O194,H42))&\" m\"","v":"1x0 m"},{"$f":"IF(IF(K42<10,INDEX(Tables!B192:O192,H42),INDEX(Tables!B194:O194,H42))>(2*I1),\"Folding\",\"Fixed\")","v":"Fixed"}]
[{"$f":"IF(K42<10,\"HRT Ant\",\"PEMS Ant\")","v":"HRT Ant"},{"$f":"IF(H45=\"Fixed\",0.05,0.1)*E45","v":0},{"$f":"B45","v":0},0,{"$f":"IF(K42<10,INDEX(Tables!B193:O193,H43),INDEX(Tables!B195:O195,H43))*VLOOKUP(K42,Tables!O158:P170,2)*I43","v":0},{"$f":"B45","v":0},{"$f":"I43&\"x\"&IF(K42<10,INDEX(Tables!B192:O192,H43),INDEX(Tables!B194:O194,H43))&\" m\"","v":"0x0 m"},{"$f":"IF(IF(K42<10,INDEX(Tables!B192:O192,H43),INDEX(Tables!B194:O194,H43))>(2*I1),\"Folding\",\"Fixed\")","v":"Fixed"}]
["Ladar",{"$f":"VLOOKUP(K46,Tables!A158:L166,(H46+1))*I46","v":0},{"$f":"2*B46","v":0},{"$f":"B46","v":0},{"$f":"B46","v":0},{"$f":"10*B46","v":0},{"$f":"CHOOSE(H46,\"None\",\"3 km\",\"30 km\",\"300 km\",\"3000 km\",\"1 hex\",\"2 hex\",\"4 hex\",\"6 hex\",\"8 hex\",\"10 hex\")","v":"None"},1,0,"Units",8,null,{"$f":"IF(OR(H46=1,I46=0),\"\",IF(I46<2,\"\",I46&\"x\")&\"Ladar (\"&G46&\"; \"&D46/I46&\" MW)\")","v":""}]
["Lidar",{"$f":"VLOOKUP(K47,Tables!R181:U187,3)*E47","v":0},{"$f":"2*B47","v":0},{"$f":"E47","v":0},{"$f":"I47*INDEX(Tables!M158:M168,H47)/VLOOKUP(K47,Tables!R181:U187,2)","v":0},{"$f":"5*E47","v":0},{"$f":"CHOOSE(H47,\"None\",\"3 km\",\"30 km\",\"300 km\",\"3000 km\",\"1 hex\",\"2 hex\",\"4 hex\",\"6 hex\",\"8 hex\",\"10 hex\")","v":"None"},1,0,"Units",8,null,{"$f":"IF(OR(H47=1,I47=0),\"\",IF(I47<2,\"\",I47&\"x\")&\"LIDAR (Tracks \"&VLOOKUP(K47,Tables!R181:U187,4)&\" targets; \"&G47&\"; \"&D47/I47&\" MW)\")","v":""}]
["Densitom",{"$f":"VLOOKUP(K48,Tables!A170:E178,3)*I48","v":0},{"$f":"VLOOKUP(K48,Tables!A170:E178,4)*I48","v":0},{"$f":"VLOOKUP(K48,Tables!A170:E178,2)*I48","v":0},{"$f":"D48*100","v":0},{"$f":"VLOOKUP(K48,Tables!A170:E178,5)*I48","v":0},null,null,0,"Units",8,null,{"$f":"IF(I48=0,\"\",IF(I48<2,\"\",I48&\"x\")&\"Densitometer (\"&D48/I48&\" MW)\")","v":""}]
["Neutrino",{"$f":"VLOOKUP(K49,Tables!F170:H175,2)*I49","v":0},{"$f":"B49","v":0},{"$f":"0.01*I49","v":0},0,{"$f":"VLOOKUP(K49,Tables!F170:H175,3)*I49","v":0},null,null,0,"Units",8,null,{"$f":"IF(I49=0,\"\",IF(I49<2,\"\",I49&\"x\")&\"Neutrino Sensor (\"&D49/I49&\" MW)\")","v":""}]
["NAS",{"$f":"0.002*I50","v":0},{"$f":"VLOOKUP(K50,Tables!I170:M176,2)*I50","v":0},{"$f":"VLOOKUP(K50,Tables!I170:M176,3)*I50","v":0},{"$f":"100*D50","v":0},{"$f":"VLOOKUP(K50,Tables!I170:M176,4)*I50","v":0},{"$f":"VLOOKUP(K50,Tables!I170:M176,5)*IF(I50=0,0,1)","v":0},"km range",0,"Units",8,null,{"$f":"IF(I50=0,\"\",IF(I50<2,\"\",I50&\"x\")&\"Neural Activity Sensor (\"&G50&\" km; \"&D50/I50&\" MW)\")","v":""}]
["Electronic Countermeasures (ECM)",null,null,null,"Area (m2)","Price (MCr)"]
["Radio Jam",{"$f":"VLOOKUP(K52,Tables!I128:Q137,H52+1)*I52","v":0},{"$f":"2*B52","v":0},{"$f":"INDEX(Tables!J139:Q139,H52)*I52*2","v":0},{"$f":"D52*5","v":0},{"$f":"INDEX(Tables!J138:Q138,H52)*I52*2","v":0},{"$f":"CHOOSE(H52,\"None\",\"3 km\",\"30 km\",\"300 km\",\"3000 km\",\"1 hex\",\"10 hex\",\"1000 AU\")","v":"None"},1,0,"Units",8,null,{"$f":"IF(OR(H52=1,I52=0),\"\",IF(I52<2,\"\",I52&\"x\")&\"Radio Jammer (\"&G52&\"; \"&D52/I52&\" MW)\")","v":""}]
[{"$f":"IF(K53<10,\"Rad Jam\",\"EMS Jam\")","v":"Rad Jam"},{"$f":"VLOOKUP(K53,Tables!A144:P155,(H53+1))*I53","v":0},{"$f":"2*B53","v":0},{"$f":"10*B53","v":0},{"$f":"IF(K53<10,VLOOKUP(K53,Tables!O158:P170,2)/10,2)*B53","v":0},{"$f":"IF(K53<10,2,4)*B53","v":0},{"$f":"CHOOSE(H53,\"None\",\"300 m\",\"3 km\",\"30 km\",\"300 km\",\"3000 km\",\"1 hex\",\"2 hex\",\"4 hex\",\"6 hex\",\"8 hex\",\"10 hex\",\"12 hex\",\"14 hex\",\"16 hex\")","v":"None"},1,0,"Units",8,null,{"$f":"IF(OR(H53=1,I53=0),\"\",IF(I53<2,\"\",I53&\"x\")&\"EMS Jammer (\"&G53&\";\"&D53/I53&\" MW)\")","v":""}]
["Area Jam",{"$f":"IF(K54<10,0,VLOOKUP(K54,Tables!A199:C205,2)*D54)","v":0},{"$f":"B54","v":0},{"$f":"IF(K54<10,0,VLOOKUP(K54,Tables!A199:C205,3)*30000*G54*I54)","v":0},0,{"$f":"2*B54","v":0},0,"Hex Rad",0,"Units",8,null,{"$f":"IF(OR(G54=0,I54=0),\"\",IF(I54<2,\"\",I54&\"x\")&\"Area Jammer (\"&G54&\" hex radius\"&\"; \"&D54/I54&\" MW)\")","v":""}]
["Dispenser",{"$f":"2*G55*I58","v":9.6000000000000002E-2},{"$f":"B55","v":9.6000000000000002E-2},0,{"$f":"IF(G55=0,0,1)","v":1},{"$f":"0.001*B55","v":9.6000000000000002E-5},16,"Ladar decoys (prismatic aerosol)",null,null,8,null,null," "]
["Dispenser",{"$f":"2*G56*I58","v":9.6000000000000002E-2},{"$f":"B56","v":9.6000000000000002E-2},0,{"$f":"IF(G56=0,0,1)","v":1},{"$f":"0.001*B56","v":9.6000000000000002E-5},16,"Radar/AEMS decoys (chaff)",null,null,8,null,null," "]
["Dispenser",{"$f":"2*G57*I58","v":9.6000000000000002E-2},{"$f":"B57","v":9.6000000000000002E-2},0,{"$f":"IF(G57=0,0,1)","v":1},{"$f":"0.001*B57","v":9.6000000000000002E-5},16,"HRT/PEMS decoys (flares)",null,null,8,null,null," "]
["Decoys",{"$f":"G58*I58","v":0.14400000000000002},{"$f":"0.5*B58","v":7.2000000000000008E-2},0,0,{"$f":"5*B58*IF(M4>1,0.05,1)","v":3.6000000000000004E-2},{"$f":"G55+G56+G57","v":48},"Decoys",{"$f":"0.003+0.001*IF(B2<1,-1,FLOOR(LOG(B2),1))","v":3.0000000000000001E-3},"m3 each",null,null,{"$f":"IF(G58=0,\"\",G58&\" sensor decoys (\"&G55&\" Laser, \"&G56&\" AEMS, \"&G57&\" PEMS)\")","v":"48 sensor decoys (16 Laser, 16 AEMS, 16 PEMS)"}]
["Stealth",{"$f":"VLOOKUP(G59,Tables!E199:K201,3)*B2","v":0},{"$f":"VLOOKUP(G59,Tables!E199:K201,4)*B2","v":0},{"$f":"VLOOKUP(G59,Tables!E199:K201,5)*B2","v":0},{"$f":"VLOOKUP(G59,Tables!E199:K201,6)*B2","v":0},{"$f":"VLOOKUP(G59,Tables!E199:K201,7)*B2","v":0},1,null,null,null,null,null,{"$f":"IF(G59>1,INDEX(Tables!F199:F201,G59)&IF(G59=3,\" (\"&IF(D59<1000,D59&\" MW)\",ROUND(D59/1000,2)&\" GW)\"),\"\"),\"\")","v":""}]
["Weapons","Vol (m3)","Mass (ton)","Pow (MW)","Area (m2)","Price (MCr)"]
["Weapon",{"$f":"INDEX(WTables!B123:B136,G61)*I61*(INDEX(Tables!$AA$15:$AA$18,M61))","v":3.65},{"$f":"INDEX(WTables!C123:C136,G61)*I61","v":1.87},{"$f":"INDEX(WTables!D123:D136,G61)*I61","v":0.36},{"$f":"INDEX(WTables!E123:E136,G61)*I61","v":0},{"$f":"INDEX(WTables!F123:F136,G61)*I61","v":0.19805},10,null,1,"Units",{"$f":"INDEX(WTables!G123:G136,G61)*I61","v":0},"crew",3]
["Weapon",{"$f":"INDEX(WTables!B123:B136,G62)*I62*(INDEX(Tables!$AA$15:$AA$18,M62))","v":2.0888},{"$f":"INDEX(WTables!C123:C136,G62)*I62","v":2.1084000000000001},{"$f":"INDEX(WTables!D123:D136,G62)*I62","v":0},{"$f":"INDEX(WTables!E123:E136,G62)*I62","v":0},{"$f":"INDEX(WTables!F123:F136,G62)*I62","v":0},11,null,7,"Units",{"$f":"INDEX(WTables!G123:G136,G62)*I62","v":0},"crew",3]
["Weapon",{"$f":"INDEX(WTables!B123:B136,G63)*I63*(INDEX(Tables!$AA$15:$AA$18,M63))","v":0.17208799999999999},{"$f":"INDEX(WTables!C123:C136,G63)*I63","v":4.6980000000000001E-2},{"$f":"INDEX(WTables!D123:D136,G63)*I63","v":0},{"$f":"INDEX(WTables!E123:E136,G63)*I63","v":0},{"$f":"INDEX(WTables!F123:F136,G63)*I63","v":3.6920000000000001E-2},2,null,4,"Units",{"$f":"INDEX(WTables!G123:G136,G63)*I63","v":0},"crew",3]
["Weapon",{"$f":"INDEX(WTables!B123:B136,G64)*I64*(INDEX(Tables!$AA$15:$AA$18,M64))","v":1.7599999999999998E-3},{"$f":"INDEX(WTables!C123:C136,G64)*I64","v":0.24915999999999999},{"$f":"INDEX(WTables!D123:D136,G64)*I64","v":0},{"$f":"INDEX(WTables!E123:E136,G64)*I64","v":0},{"$f":"INDEX(WTables!F123:F136,G64)*I64","v":0.01},3,null,20,"Units",{"$f":"INDEX(WTables!G123:G136,G64)*I64","v":0},"crew",3]
["Weapon",{"$f":"INDEX(WTables!B123:B136,G65)*I65*(INDEX(Tables!$AA$15:$AA$18,M65))","v":4.4000000000000004},{"$f":"INDEX(WTables!C123:C136,G65)*I65","v":0.44},{"$f":"INDEX(WTables!D123:D136,G65)*I65","v":0},{"$f":"INDEX(WTables!E123:E136,G65)*I65","v":0},{"$f":"INDEX(WTables!F123:F136,G65)*I65","v":0.17499999999999999},14,null,1,"Units",{"$f":"INDEX(WTables!G123:G136,G65)*I65","v":0},"crew",4]
["Defense",{"$f":"INDEX(WTables!B123:B136,G66)*I66*(INDEX(Tables!$AA$15:$AA$18,M66))","v":0},{"$f":"INDEX(WTables!C123:C136,G66)*I66","v":0},{"$f":"INDEX(WTables!D123:D136,G66)*I66","v":0},{"$f":"INDEX(WTables!E123:E136,G66)*I66","v":0},{"$f":"INDEX(WTables!F123:F136,G66)*I66","v":0},3,null,0,"Units",{"$f":"INDEX(WTables!G123:G136,G66)*I66","v":0},"crew",4]
["Magazine",0,0,0,0,0,{"$f":"7*0","v":0},"m3 missile storage"]
["Screens","Vol (m3)","Mass (ton)","Pow (MW)","Area (m2)","Price (MCr)"]
["Nuclear",{"$f":"VLOOKUP(K69,Tables!A209:E216,2)*D69","v":0},{"$f":"B69","v":0},{"$f":"VLOOKUP(K69,Tables!A209:E216,3)*G69*30000*I69","v":0},{"$f":"B69*0.1","v":0},{"$f":"VLOOKUP(K69,Tables!A209:E216,4)*D69","v":0},0,"Hex Range",0,"Units",8,null,{"$f":"IF(I69=0,\"\",I69&\"xNuclear Damper (\"&G69&\" hex; \"&D69&\" MW; 1 Crew)\")","v":""}]
["Meson",{"$f":"20*D70","v":0},{"$f":"0.75*B70","v":0},{"$f":"IF(K70<12,0,I70*VLOOKUP(ROUNDDOWN(LOG(B2),1),Tables!H209:I215,2)*(G70/VLOOKUP(K70,Tables!F209:G218,2))^2)","v":0},{"$f":"10*D70","v":0},{"$f":"0.1*B70","v":0},0,"PV",0,"Units",8,null,{"$f":"IF(I70=0,\"\",\"Meson Screen Generator (PV=\"&G70&\"; \"&ROUND(D70,1)&\" MW; 1 Crew)\")","v":""}]
["Fire Control",null,"Mass (ton)","Pow (MW)","Area (m2)","Price (MCr)"]
["MFD",{"$f":"VLOOKUP(K72,Tables!A366:C373,2)*G72*I72","v":0},{"$f":"B72","v":0},{"$f":"0.01*B72","v":0},0,{"$f":"B72","v":0},10,"Hex Range",0,"Units",10,null,{"$f":"IF(OR(G72=1,I72=0,I72-I74<1),\"\",IF(I72<2,\"\",I72-I74&\"x\")&\"TL-\"&K72&\" (\"&G73&\" Diff Mods; \"&INDEX(Tables!A376:A385,G72)&\" hex; \"&IF(D72>0,(D72+D73)/I72&\" MW; \",\"\")&\"1 crew)\")","v":""}]
[{"$f":"\"FC \"&IF(K72<10,\"Radar\",\"AEMS\")","v":"FC AEMS"},{"$f":"VLOOKUP(K72,Tables!A144:P155,LOOKUP(G72,{1,2,3,4,5,6,7,8,9,10},{8,9,10,10,11,11,12,12,13,13}))*I72","v":0},{"$f":"2*B73","v":0},{"$f":"5*0.1*B73","v":0},{"$f":"2*0.1*B73","v":0},{"$f":"2*0.5*B73","v":0},{"$f":"VLOOKUP(K72,Tables!A366:C373,3)","v":3},"Diff Mods"]
[{"$f":"\"FC \"&IF(G74=1,\"Laser\",\"Maser\")","v":"FC Maser"},{"$f":"IF(G74=1,VLOOKUP(K72,Tables!A117:I123,IF(G72=1,7,8)),VLOOKUP(K72,Tables!J117:R123,IF(G72=1,7,8)) )* I74","v":0},{"$f":"2*B74","v":0},{"$f":"IF(G74=1,INDEX(Tables!B125:I125,IF(G72=1,6,7)),INDEX(Tables!K125:R125,IF(G72=1,6,7))) * I74","v":0},{"$f":"1*I74","v":0},{"$f":"IF(G74=1,INDEX(Tables!B124:I124,IF(G72=1,6,7)),INDEX(Tables!K124:R124,IF(G72=1,6,7))) * I74","v":0},2,{"$f":"VLOOKUP(K72,Tables!A366:C373,3)*MIN(I72,I74)&\" msls\"","v":"0 msls"},0,"Units",null,null,{"$f":"IF(OR(G72=1,I72=0,I74=0),\"\",IF(I72<2,\"\",MIN(I72,I74)&\"x\")&\"TL-\"&K72&\" (\"&G73&\" Diff Mods; \"&INDEX(Tables!A376:A385,G72)&\" hex; \"&\"Msl \"&IF(G72=1,1,10)&\" hex; \"&IF(D72>0,D74/I74+(D72+D73)/I72&\" MW; \",\"\")&\"1 crew)\")","v":""}]
["Crew","Vol (m3)","Mass (ton)","Pow (MW)","Area (m2)","Price (MCr)"]
["Driver",{"$f":"3.5*I76","v":3.5},{"$f":"0.3*I76","v":0.3},null,null,null,null,null,1,"Units"]
["Commander",{"$f":"3.5*I77*G77","v":7},0.3,null,null,null,2,null,1,"Units"]
["Gunner",7,0.3,null,null,null,2,null,1,"Units"]
["Gunner",0,0,null,null,null,2,null,0,"Units"]
["Loader",0,0,null,null,null,2,null,0,"Units"]
["Loader",0,0,null,null,null,2,null,0,"Units"]
["Other ",0,0,null,null,null,2,null,0,"Units"]
[null,null,null,null,null,null,null,null,null,null,null,null,{"$f":"IF(OR(G83=1,I83=0),\"\",\", \"&IF(I83>1,I83&\"x\",\"\")&K83&\"-ton \"&INDEX(Tables!I223:I230,G83))","v":""}]
[null,null,null,null,null,null,null,null,null,null,null,null,{"$f":"IF(OR(G84=1,I84=0),\"\",\", \"&IF(I84>1,I84&\"x\",\"\")&K84&\"-ton \"&INDEX(Tables!I223:I230,G84))","v":""}]
[null,null,null,null,null,null,null,null,null,null,null,null,{"$f":"IF(OR(G85=1,I85=0),\"\",\", \"&IF(I85>1,I85&\"x\",\"\")&K85&\"-ton \"&INDEX(Tables!I223:I230,G85))","v":""}]
["Optional Features",null,"Mass (ton)","Pow (MW)","Area (m2)","Price (MCr)",null,null,null,null,null,null,{"$f":"IF(OR(G86=1,I86=0),\"\",\", \"&IF(I86>1,I86&\"x\",\"\")&K83&\"-ton \"&INDEX(Tables!I223:I230,G86))","v":""}]
[null,null,null,null,null,null,null,null,null,null,null,null,{"$f":"IF(OR(G87=1,I87=0),\"\",\", \"&IF(I87>1,I87&\"x\",\"\")&K87&\"-ton \"&INDEX(Tables!I223:I230,G87))","v":""}]
[null,null,null,null,null,null,null," ",null,null,null,null,{"$f":"IF(OR(G88=1,I88=0),\"\",IF(I88>1,I88&\"x\",\"\")&INDEX(Tables!N223:N230,G88)&\"-ton bay\")","v":""}]
["Seats",{"$f":"INDEX(Tables!J234:J238,G89) * I89","v":0},{"$f":"INDEX(Tables!K234:K238,G89)*I89","v":0},0,0,{"$f":"INDEX(Tables!L234:L238,G89)*I89","v":0},3,null,0,"Units"]
["Extra Fuel",{"$f":"14*I90","v":0},{"$f":"B90*INDEX(Tables!L261:L273,G90)","v":0},0,0,0,10,null,0,"DT"]
["Cargo hold",{"$f":"14*G91","v":0},{"$f":"0.25*B91","v":0},0,0,0,0,"TD"]
["C-Hatch",0,0,0,{"$f":"G92*IF(B91<100,12,20)*IF(G91=0,0,1)","v":0},{"$f":"G92*IF(B91<100,0.012,0.02)*IF(G91=0,0,1)","v":0},{"$f":"MAX(1,(FLOOR(B91/350,1)))*IF(G91=0,0,1)","v":0},{"$f":"IF(B91<100,\"Small Hatch\",\"Large Hatches\")","v":"Small Hatch"}]
["Life Support",null,"Mass (ton)","Pow (MW)","Area (m2)","Price (MCr)",null,null,null,null,14]
["Air Locks",{"$f":"CHOOSE(G94,0,0,3)*I94","v":0},{"$f":"CHOOSE(G94,0,0,0.2)*I94","v":0},{"$f":"CHOOSE(G94,0,0,0.001)*I94","v":0},{"$f":"CHOOSE(G94,0,2,2)*I94","v":0},{"$f":"CHOOSE(G94,0,0.002,0.005)*I94","v":0},1,null,0,"units",{"$f":"MAX(1,FLOOR(B2/100,1))","v":1},"required",{"$f":"INDEX(Tables!A346:A350,G95)&\" (\"&K95&\" m3 supported volume; \"&ROUND(D95,3)&\" MW)\"","v":"Overpressure (53 m3 supported volume; 0 MW)"}]
["Life Supp.",{"$f":"K95*INDEX(Tables!B346:B350,G95)","v":5.2999999999999999E-2},{"$f":"B95*INDEX(Tables!C346:C350,G95)","v":5.2999999999999999E-2},{"$f":"B95*INDEX(Tables!D346:D350,G95)","v":0},0,{"$f":"B95*INDEX(Tables!E346:E350,G95)","v":5.3E-3},3,null,1,null,{"$f":"ROUND(CHOOSE(I95,B2*14-B126,B2*14-(B126+B141),SUM(B78:B81)+B89+B91+SUM(B97:B102)+B109+B110),0)","v":53},"m3 LS volume",{"$f":"MIN(K93-9,9)","v":5},"Gs Compensated"]
["Gravity",{"$f":"K96*INDEX(Tables!I346:I352,G96)","v":0},{"$f":"B96*INDEX(Tables!J346:J352,G96)","v":0},{"$f":"B96*INDEX(Tables!K346:K352,G96)","v":0},0,{"$f":"B96*INDEX(Tables!L346:L352,G96)","v":0},1,null,1,null,{"$f":"ROUND(CHOOSE(I96,B2*14-B126,B2*14-(B126+B141),SUM(B78:B81)+B89+B91+SUM(B97:B102)+B109+B110),0)","v":53},"m3 AG volume",{"$f":"IF(G96=1,\"\",\", \"&INDEX(Tables!H346:H352,G96)&IF(G96=7,\" (\"&D96&\" MW)\",\"\"))","v":""}]
["G Tanks",{"$f":"2*I97","v":0},{"$f":"B97","v":0},0,0,{"$f":"I97","v":0},null,null,0,"Units",{"$f":"IF(I20>(MIN(K93-9,9)+1),I109+I110,0)&\" required\"","v":"0 required"}]
["Bunk",{"$f":"14*I98","v":0},{"$f":"0.5*I98","v":0},0,0,{"$f":"0.005*I98","v":0},null,null,0,"Units",null,null,{"$f":"IF(I98>0,IF(I99+I101+I102+I103+I104=0,\"\",\", \")&IF(I98>1,I98&\"x\",\"\")&\"Bunk\",\"\")","v":""}]
["Low Berth",{"$f":"14*I99","v":0},{"$f":"1*I99","v":0},{"$f":"0.001*I99","v":0},0,{"$f":"0.05*I99","v":0},null,null,0,"Units",{"$f":"I138&\" required\"","v":" required"},null,{"$f":"IF(I99>0,IF(I101+I102+I103+I104=0,\"\",\", \")&IF(I99>1,I99&\"x\",\"\")&\"Low Berth (1 kW)\",\"\")","v":""}]
["Em. Low",{"$f":"28*I100","v":0},{"$f":"2*I100","v":0},{"$f":"0.002*I100","v":0},0,{"$f":"0.1*I100","v":0},null,null,0,"Units",null,null,{"$f":"IF(I100>0,IF(I100>1,I100&\"x\",\"\")&\"Emergency Low Berth (2 kW)\",\"\")","v":""}]
["Small Staterooms",{"$f":"28*I101","v":0},{"$f":"2*I101","v":0},{"$f":"0.0005*I101","v":0},0,{"$f":"0.04*I101","v":0},null,null,0,"Units",{"$f":"I134+CEILING((SUM(I127:I137)-I134)/2,1)&\" required\"","v":"0 required"},null,{"$f":"IF(I101>0,IF(I102+I103+I104=0,\"\",\", \")&IF(I101>1,I101&\"x\",\"\")&\"Small Stateroom (0.5 kW)\",\"\")","v":""}]
["Large Stateroom",{"$f":"56*I102","v":0},{"$f":"4*I102","v":0},{"$f":"0.001*I102","v":0},0,{"$f":"0.1*I102","v":0},null,null,0,"Units",null,null,{"$f":"IF(I102>0,IF(I104+I103=0,\"\",\", \")&IF(I102>1,I102&\"x\",\"\")&\"Large Stateroom (1 kW)\",\"\")","v":""}]
["Small Crew Bay",{"$f":"70*I103","v":0},{"$f":"5*I103","v":0},{"$f":"0.002*I103","v":0},0,{"$f":"0.14*I103","v":0},null,null,0,"Units",null,null,{"$f":"IF(I103>0,IF(I104=0,\"\",\", \")&IF(I103>1,I103&\"x\",\"\")&\"Small Crew Bay (2 kW)\",\"\")","v":""}]
["Large Crew Bay",{"$f":"140*I104","v":0},{"$f":"10*I104","v":0},{"$f":"0.004*I104","v":0},0,{"$f":"0.28*I104","v":0},null,null,0,"Units",null,null,{"$f":"IF(I104>0,IF(I104>1,I104&\"x\",\"\")&\"Large Crew Bay (4 kW)\",\"\")","v":""}]
["Low Berth",{"$f":"14*I105","v":0},{"$f":"I105","v":0},{"$f":"0.001*I105","v":0},0,{"$f":"0.05*I105","v":0},"Low passengers",null,0,"Units",null,null,{"$f":"IF(I105>0,IF(I106+I107=0,\"\",\", \")&IF(I105>1,I105&\"x\",\"\")&\"Low Berth (1 kW)\",\"\")","v":""}]
["Small Staterooms",{"$f":"28*I106","v":0},{"$f":"2*I106","v":0},{"$f":"0.0005*I106","v":0},0,{"$f":"0.04*I106","v":0},"Middle passengers",null,0,"Units",null,null,{"$f":"IF(I106>0,IF(I107=0,\"\",\", \")&IF(I106>1,I106&\"x\",\"\")&\"Small Stateroom (0.5 kW)\",\"\")","v":""}]
["Large Stateroom",{"$f":"56*I107","v":0},{"$f":"4*I107","v":0},{"$f":"0.001*I107","v":0},0,{"$f":"0.1*I107","v":0},"High passengers",null,0,"Units",null,null,{"$f":"IF(I107>0,IF(I107>1,I107&\"x\",\"\")&\"Large Stateroom (1 kW)\",\"\")","v":""}]
["FC Center",{"$f":"7*I108","v":0},{"$f":"0.2*I108","v":0},0,0,{"$f":"0.002*I108","v":0},{"$f":"I72&\" MFDs, \"&I69+I70&\" screens\"","v":"0 MFDs, 0 screens"},null,0,{"$f":"IF(I108>I69+I70+I72,\"Error: Max \"&I69+I70+I72&\" \",\"\")&\"fire control workstations\"","v":"fire control workstations"},null,null,{"$f":"IF(I108=0,\"\",\"fire control center (\"&I108&\" workstations)\")","v":""}]
["Bridge WS",{"$f":"14*I109","v":0},{"$f":"0.2*I109","v":0},0,0,{"$f":"VLOOKUP(K93,Tables!A74:E83,5)*I109","v":0},null,null,{"$f":"IF(I134>1,MAX(0,I72-I108)+I128+I127+H136+I134,0)","v":0},"Units",null,null,{"$f":"IF(I100>0,IF(M100=\"\",\"\",\", \")&IF(I100>1,I100&\"x\",\"\")&\"Emergancy Low Berth (2 kW)\",\"\")","v":""}]
["Norm WS",{"$f":"3.5*I110","v":0},{"$f":"0.2*I110","v":0},0,0,{"$f":"0.002*I110","v":0},null,null,{"$f":"I129 + IF(I134>1,0,MAX(0,I72-I108)+I128+I127+H136+I134) + MAX(0,I69+I70-MAX(0,I108-I72))","v":0},"Units"]
["Other Systems"]
[null,{"$f":"0.15*G112","v":0},{"$f":"B112*2","v":0},null,null,{"$f":"0.5*G112*IF(M4=2,0.5,1)","v":0},0,"mj esa",null,"epg Cartrige info"]
[null,{"$f":"0.05*G112","v":0},{"$f":"B113*2","v":0},null,null,{"$f":"B113*0.01","v":0},"hpg",null,null,{"$f":"C114/G114*1000","v":{"$error":"#DIV/0!"}},"kg each"]
[null,{"$f":"0.0003*G112*G114","v":0},{"$f":"B114*8","v":0},null,null,{"$f":"0.000025*G112","v":0},0,"epg cartridges",null," "]
[null,{"$f":"B113*0.05*$G$115","v":0},{"$f":"C113*0.05*$G$115","v":0},null,null,{"$f":"F113*0.05*$G$115","v":0},0,"additional ready epg's in hpg"]
[null,null,null,null,null,null,{"$f":"G112*6","v":0},"vs. HE",{"$f":"G116/2","v":0},"vs. KE"]
["Water Jets",{"$f":"0.05*B25*(G117-10)/10*(G117-10)/10","v":0},{"$f":"B117","v":0},null,null,null,10,"% ground speed for water speed (tracked)"]
["Externally Carried Systems",null,null,"Pow (MW)","Area (m2)","Price (MCr)",null,null,null,null,12]
[null,null,null,null,null,null,0,"DT tank",0,"units"]
[]
["Stealth",0,0,{"$f":"I119 * VLOOKUP(G59,Tables!E199:K201,5)*G119","v":0},{"$f":"I119 * VLOOKUP(G59,Tables!E199:K201,6)*G119","v":0},0,null,null,null,null,null,null,null,"Scale Efficiency","Low Automation",1,0.95]
["Drop Fuel",0,0,0,0,0,10,null,null,null,null,null,null,"No Scale Efficiency","Standard Automation",3,1]
["Subcrafts",0,0,0,0,0,null,null,null,null,null,null,null,null,"High Automation",5,1.1000000000000001]
[]
["Total","Vol (m3)","Mass (ton)","Pow (MW)","Area (m2)","Price (MCr)",null,null,3]
["Hull",{"$f":"SUM(B9:B17)*IF(M4>1,0.85,1)","v":14.078776666666666},{"$f":"SUM(C9:C17)*IF(M4>1,0.85,1)","v":36.470213333333334},null,null,{"$f":"SUM(F9:F11)","v":0.1663232},null,null,"Crew Requirements"]
["Suspsension",{"$f":"SUM(B19:B23)","v":14.139999999999999},{"$f":"SUM(C19:C23)","v":17.5}]
[" "," "," "," "," ",{"$f":"SUM(F19:F21)","v":0}]
["Power",{"$f":"B25","v":2.3333333333333335},{"$f":"C25","v":2.3333333333333335},null,null,{"$f":"F25","v":2.3333333333333334E-2}]
["Controls",{"$f":"SUM(B28:B33)","v":6.8199999999999997E-2},{"$f":"SUM(C28:C33)","v":7.7200000000000003E-3},{"$f":"SUM(D28:D33)","v":1.24E-2},{"$f":"SUM(E28:E33)","v":0},{"$f":"SUM(F28:F33)","v":2.3599999999999999E-2}]
["Commun",{"$f":"SUM(B35:B38)","v":2.6000000000000002E-2},{"$f":"SUM(C35:C38)","v":5.2000000000000005E-2},{"$f":"SUM(D35:D38)","v":0.02},{"$f":"SUM(E35:E38)","v":1.1000000000000001},{"$f":"SUM(F35:F38)","v":5.4999999999999997E-3}]
["Sensors",{"$f":"SUM(B40:B50)","v":0},{"$f":"SUM(C40:C50)","v":0},{"$f":"SUM(D40:D50)","v":0},{"$f":"SUM(E40:E50)","v":0},{"$f":"SUM(F40:F50)","v":0}]
["ECM",{"$f":"SUM(B52:B59)","v":0.43200000000000005},{"$f":"SUM(C52:C59)","v":0.36000000000000004},{"$f":"SUM(D52:D59)","v":0},{"$f":"SUM(E52:E59)","v":3},{"$f":"SUM(F52:F59)","v":3.6288000000000001E-2}]
["Weapons",{"$f":"SUM(B61:B67)","v":10.312647999999999},{"$f":"SUM(C61:C67)","v":4.7145400000000004},{"$f":"SUM(D61:D67)","v":0.36},{"$f":"SUM(E61:E67)","v":0},{"$f":"SUM(F61:F67)","v":0.41997000000000001}]
["Screens",{"$f":"SUM(B69:B70)","v":0},{"$f":"SUM(C69:C70)","v":0},{"$f":"SUM(D69:D70)","v":0},{"$f":"SUM(E69:E70)","v":0},{"$f":"SUM(F69:F70)","v":0}]
["Fire Cont.",{"$f":"SUM(B72:B74)","v":0},{"$f":"SUM(C72:C74)","v":0},{"$f":"SUM(D72:D74)","v":0},{"$f":"SUM(E72:E74)","v":0},{"$f":"SUM(F72:F74)","v":0}]
["Crew",{"$f":"SUM(B76:B92)-B90","v":17.5},{"$f":"SUM(C76:C92)-C90","v":0.89999999999999991},{"$f":"SUM(D76:D92)","v":0},{"$f":"SUM(E76:E92)","v":0},{"$f":"SUM(F76:F92)","v":0}]
["Life Supp",{"$f":"SUM(B94:B110)","v":5.2999999999999999E-2},{"$f":"SUM(C94:C110)","v":5.2999999999999999E-2},{"$f":"SUM(D94:D110)","v":0},{"$f":"SUM(E94:E110)","v":0},{"$f":"SUM(F94:F110)","v":5.3E-3}]
["Other",{"$f":"SUM(B112:B117)","v":0},{"$f":"SUM(C112:C117)","v":0},{"$f":"SUM(D112:D117)","v":0},{"$f":"SUM(E112:E117)","v":0},{"$f":"SUM(F112:F117)","v":0}]
["Subcrafts",0,0,0,0,0]
["Fuel Tank",{"$f":"B26","v":3.3599999999999994},{"$f":"C26","v":0.23519999999999999},0,0,0,null,{"$f":"ROUND((C143-C126-C140)/VLOOKUP(K32,Tables!G73:H80,2)/IF(F1=0,IF(I32+I33>1,4,1),IF(I32+I33>2,4,1)),0)","v":7},"Maintenance Points"]
[null,null,null,null,null,null,null,{"$f":"C143/5","v":12.525201333333332},"Maintenance Points"]
["Internal",{"$f":"SUM(B126:B141)","v":62.303957999999994},{"$f":"SUM(C126:C141)","v":62.626006666666662},{"$f":"SUM(D126:D141)","v":0.39239999999999997},{"$f":"SUM(E126:E141)","v":4.0999999999999996},{"$f":"SUM(F126:F141)","v":0.68031453333333336},null,{"$f":"IF(G22=\"HRF\",B22,0)+IF(G23=\"HRF\",B23,0)+IF(VLOOKUP(G25,Tables!A243:H247,8)=9,B26,0)+IF(G90=9,B90,0)+IF(G122=9,B122,0)","v":0},"m3 HRF",null,{"$f":"MIN(Ship!K19,Ship!K25,Ship!K29,Ship!K30,Ship!K31,Ship!K32,Ship!K35,Ship!K36,Ship!K37,Ship!K38,Ship!K40,Ship!K42,Ship!K46,Ship!K48,Ship!K49,Ship!K50,Ship!K52,Ship!K53,Ship!K54,Ship!K69,Ship!K70,Ship!K72,Ship!K76,Ship!K93)","v":8},"Min TL"]
["Remaining",{"$f":"14*B2-B143","v":4.8960420000000084},null,{"$f":"D25-D143","v":1.0076000000000001},{"$f":"SUM(E22,E143)*-1","v":-37.700000000000003},null,null,{"$f":"IF(G22=\"LHyd\",B22,0)+IF(G23=\"LHyd\",B23,0)+IF(VLOOKUP(G25,Tables!A243:H247,8)=10,B26,0)+IF(G90=10,B90,0)+IF(G122=10,B122,0)+B16","v":0.21666666666666667},"m3 LHyd",null,{"$f":"MAX(Ship!K9,Ship!K19,Ship!K25,Ship!K29,Ship!K30,Ship!K31,Ship!K32,Ship!K35,Ship!K36,Ship!K37,Ship!K38,Ship!K40,Ship!K42,Ship!K46,Ship!K48,Ship!K49,Ship!K50,Ship!K52,Ship!K53,Ship!K54,Ship!K69,Ship!K70,Ship!K72,Ship!K76,Ship!K93)","v":14},"Max TL"]
[null,{"$f":"B143-((B134+B137-3.5)/2)","v":50.147633999999996},null,null,null,null,null,{"$f":"IF(G22=\"Radioactive\",B22,0)+IF(G23=\"Radioactive\",B23,0)+IF(VLOOKUP(G25,Tables!A243:H247,8)=11,B26,0)+IF(G90=11,B90,0)+IF(G122=11,B122,0)","v":0},"m3 Radioactive"]
[null,{"$f":"IF(B145/C143>1,\"Amphibious\",\"Not Amphibious\")","v":"Not Amphibious"},null,null,null,null,null,{"$f":"IF(G22=\"Antimatter\",B22,0)+IF(G23=\"Antimatter\",B23,0)+IF(VLOOKUP(G25,Tables!A243:H247,8)=12,B26,0)+IF(G90=12,B90,0)+IF(G122=12,B122,0)","v":0},"m3 Antimatter"]
[null,null,null,null,null,null,null,{"$f":"IF(G22=\"Water\",B22,0)+IF(G23=\"Water\",B23,0)+IF(VLOOKUP(G25,Tables!A243:H247,8)=13,B26,0)+IF(G90=13,B90,0)+IF(G122=13,B122,0)","v":0},"m3 Water"]
["External",{"$f":"SUM(B119:B123)","v":0},{"$f":"SUM(C119:C123)","v":0},{"$f":"SUM(D119:D123)","v":0},null,{"$f":"SUM(F119:F123)","v":0}]
[]
["Total",{"$f":"B143+B148","v":62.303957999999994},{"$f":"C143+C148","v":62.626006666666662},{"$f":"D143+D148","v":0.39239999999999997},{"$f":"E143+E148","v":4.0999999999999996},{"$f":"F143+F148","v":0.68031453333333336}]
[]
[null,null,"Cross-country"]
[null,null,"Wheeled Speed ",null,"Tracked Speed"]
["Vehicle road speed",null,"km/h","Com ","km/h","Com"]
[{"$f":"($D$144/$C$143*2500)+(IF($K$144>4,$K$144-5,0))+5","v":54.222906330394586},"km/h",{"$f":"A155+15","v":69.222906330394579},{"$f":"ROUND(C155*0.463/5,0)*5","v":30},{"$f":"A155","v":54.222906330394586},{"$f":"ROUND(E155*0.463/5,0)*5","v":25}]
[{"$f":"$A$155*0.6","v":32.533743798236749},"mph",{"$f":"C155*0.6","v":41.533743798236749},{"$f":"ROUND(C156*0.463/5,0)*5","v":20},{"$f":"E155*0.8","v":43.378325064315675},{"$f":"ROUND(E156*0.463/5,0)*5","v":20}]
[{"$f":"$D$144/$C$143","v":1.6089162532157836E-2},null,{"$f":"C155*0.1","v":6.9222906330394585},{"$f":"ROUND(C157*0.463/5,0)*5","v":5},{"$f":"E155*(G117/100)","v":5.4222906330394594},{"$f":"ROUND(E157*0.463/5,0)*5","v":5}]
[]
[null,null,"Real-world adjusted speeds"]
[null,null,"Cross-country"]
[null,null,"Wheeled Speed ",null,"Tracked Speed",null,"Tracked",null,"Tracked Speed"," "]
["Vehicle road speed",null,"km/h","Com ","km/h","Com","Travel (T2K)",null,"mph"]
[{"$f":"(($D$144/$C$143*2500)+(IF($K$144>4,$K$144-5,0))+5)*1.4","v":75.912068862552417},"km/h",{"$f":"A163+15","v":90.912068862552417},{"$f":"ROUND(C163*0.463/5,0)*5","v":40},{"$f":"A163","v":75.912068862552417},{"$f":"ROUND(E163*0.463/5,0)*5","v":35},{"$f":"E163*4.32/2","v":163.97006874311322},null,{"$f":"E163*0.6","v":45.547241317531451}]
[{"$f":"$A$163*0.6","v":45.547241317531451},"mph",{"$f":"C163*0.4","v":36.364827545020965},{"$f":"ROUND(C164*0.463/5,0)*5","v":15},{"$f":"E163*0.7","v":53.138448203786687},{"$f":"ROUND(E164*0.463/5,0)*5","v":25},{"$f":"E164*4.32/2","v":114.77904812017925},null,{"$f":"E164*0.6","v":31.88306892227201}]
[{"$f":"$D$144/$C$143","v":1.6089162532157836E-2},null,{"$f":"C163*0.1","v":9.0912068862552413},{"$f":"ROUND(C165*0.463,0)","v":4},{"$f":"E163*(G117/100)","v":7.5912068862552422},{"$f":"ROUND(E165*0.463,0)","v":4},{"$f":"4.32*E165/2","v":16.397006874311323},null,{"$f":"E165*0.6","v":4.5547241317531455}]
[null,null,null,null,null,null,null," "]

{"sheet":"BL-BR Data","index":3,"n_rows":69,"n_cols":11,"rows_kept":69,"cut":false,"hidden":false,"merged":[]}
["General Data"]
[{"$f":"\"Displacement: \"&Ship!B2&IF(Ship!B148>0,\"/\"&Ship!B2+ROUND(Ship!B148/14,0),\"\")&\" tons\"","v":"Displacement: 4.8 tons"},null,null,null,{"$f":"\"Hull Armor: \"&Ship!I9","v":"Hull Armor: 0"}]
[{"$f":"\"Length: \"&Ship!L1&\" meters\"","v":"Length: 6.78 meters"},null,null,null,{"$f":"\"Volume: \"&Ship!B2*14&IF(Ship!B148>0,\"/\"&ROUND(Ship!B2*14+Ship!B148,0),\"\")&\" m3\"","v":"Volume: 67.2 m3"}]
[{"$f":"\"Price: MCr \"&ROUND(Ship!F143,1)","v":"Price: MCr 0.7"},null,null,null,{"$f":"\"Target Size: \"&SizeCode(Ship!B2)","v":{"$error":"#NAME?"}}]
[{"$f":"\"Configuration: \"&INDEX(Tables!Q1:Q3,Ship!B4)&\" \"&INDEX(Tables!A3:A22,Ship!B3)","v":{"$error":"#REF!"}},null,null,null,{"$f":"\"Tech Level: \"&IF(Ship!K143=Ship!K144,Ship!K143,Ship!K143&\"/\"&Ship!K144)","v":"Tech Level: 8/14"}]
[{"$f":"\"Mass (Loaded/Empty): \"&ROUND(Ship!C150,1)&\" / \"&ROUND(Ship!C150-(Ship!C141+Ship!C122+Ship!C91),1)&IF(Ship!C148=0,\"\",\" with external systems, \"&ROUND(Ship!C143,1)&\" / \"&ROUND(Ship!C143-(Ship!C141+Ship!C91),1)&\" without external systems\")","v":"Mass (Loaded/Empty): 62.6 / 62.4"}]
[]
["Engineering Data"]
[{"$f":"Ship!M25","v":"Power Plant: 1.4 MW N/A Power Plant, 12 hour duration (3.4 m3 fuel)"}]
[{"$f":"CHOOSE(Ship!G13,\"\",\"Jump Performance: \",\"Jump Performance: \",\"Warp Efficiency: \",\"Subspace Velocity: \")&Ship!F1&CHOOSE(Ship!G13,\"\",\" (\"&Ship!B16&\" m3 fuel)\",\" (\"&Ship!B16&\" m3 fuel)\",\" (\"&Ship!I13&\" MW)\",\" Parsec/hour (\"&Ship!I13&\" MW)\")","v":""}]
[{"$f":"\"G-Rating: \"&Ship!M20&Ship!M21&Ship!M19","v":"G-Rating: "}]
[{"$f":"\"G-Turns: \"&IF(Ship!B22=0,\"None\",Ship!I22)&IF(AND(Ship!B22>0,Ship!F1>0),\" (\"&Ship!M12&Ship!M13&Ship!M14&Ship!M15&Ship!M16&Ship!M18&\")\",\"\")&IF(Ship!B22=0,\"\",\", \"&ROUND(Ship!B22/Ship!I22,1)&\" m3 fuel each\")","v":{"$error":"#DIV/0!"}}]
[{"$f":"\"Maint: \"&Ship!H141","v":"Maint: 7"}]
[]
["Electronics"]
[{"$f":"\"Computer: \"&IF(Ship!I32=0,\"\",Ship!M32)&IF(Ship!I33=0,\"\",\", \"&Ship!M33)","v":"Computer: "}]
[{"$f":"\"Commo: \"&Ship!M35&IF(Ship!M35=\"\",\"\",\", \")&Ship!M36&IF(Ship!M36=\"\",\"\",\", \")&Ship!M37&IF(Ship!M37=\"\",\"\",\", \")&Ship!M38","v":"Commo: Laser (30 km; 0.01 MW), Radio (300 km; 0.01 MW)"}]
[{"$f":"\"Avionics: \"&Ship!M29&Ship!M31&Ship!M30","v":"Avionics: , Satellite positioning"}]
[{"$f":"\"Sensors: \"&Ship!M40&IF(Ship!M40=\"\",\"\",\", \")&Ship!M42&IF(Ship!M42=\"\",\"\",\", \")&Ship!M46&IF(Ship!M46=\"\",\"\",\", \")&Ship!M48&IF(Ship!M48=\"\",\"\",\", \")&Ship!M49&IF(Ship!M49=\"\",\"\",\", \")&Ship!M50","v":"Sensors: "}]
[{"$f":"\"ECM/ECCM: \"&IF(AND(Ship!I52+Ship!I53+Ship!I54=0,Ship!G59=1),\"None\",Ship!M52&IF(Ship!M52=\"\",\"\",\", \")&Ship!M53&IF(Ship!M53=\"\",\"\",\", \")&Ship!M54&IF(Ship!M54=\"\",\"\",\", \")&Ship!M58&IF(Ship!M58=\"\",\"\",\", \")&Ship!M59)","v":"ECM/ECCM: None"}]
[{"$f":"\"Controls: \"&IF(Ship!I109=0,\"No bridge, \",\"Bridge with \"&Ship!I109&\" bridge workstations, \")&Ship!I110&\" normal workstations, \"&Ship!M108&\", \"&INDEX(Ship!O121:O123,Ship!G28)","v":"Controls: No bridge, 0 normal workstations, , Standard Automation"}]
[]
["Armament"]
[{"$f":"\"Offensive: \"&IF(Ship!I61+Ship!I62+Ship!I63+Ship!I64+Ship!I65=0,\"None\",Ship!M61&IF(Ship!M62=\"\",\"\",\", \")&Ship!M62&IF(Ship!M63=\"\",\"\",\", \")&Ship!M63&IF(Ship!M64=\"\",\"\",\", \")&Ship!M64&IF(Ship!M65=\"\",\"\",\", \")&Ship!M65)","v":"Offensive: 3, 3, 3, 3, 4"}]
[{"$f":"\"Defensive: \"&IF(Ship!I70=0,\"\",Ship!M70&\", \")&IF(Ship!I69=0,\"\",Ship!M69&\", \")&Ship!M66","v":"Defensive: 4"}]
[{"$f":"\"Master Fire Directors: \"&IF(Ship!I72=0,\"None\",Ship!M72&IF(Ship!M72=\"\",\"\",\", \")&Ship!M74)","v":"Master Fire Directors: None"}]
[]
["Accommodations"]
[{"$f":"\"Life Support: \"&Ship!M94&Ship!M96","v":"Life Support: Overpressure (53 m3 supported volume; 0 MW)"}]
[{"$f":"\"Crew: \"&Ship!I140&\" (\"&Ship!I127&\"xManeuver\"&\", \"&Ship!I128&\"xElectronics\"&IF(Ship!I129=0,\"\",\", \"&Ship!I129&\"xEngineer\")&IF(Ship!I131=0,\"\",\", \"&Ship!I131&\"xGunnery\")&IF(Ship!I130=0,\"\",\", \"&Ship!I130&\"xMaintenance\")& IF(Ship!I133=0,\"\",\", \"&Ship!I133&\"xShip's Troops\")&IF(Ship!I132=0,\"\",\", \"&Ship!I132&\"xFlight\")&IF(Ship!I136=0,\"\",\", \"&Ship!I136&\"xSteward\")& IF(Ship!I137=0,\"\",\", \"&Ship!I137&\"xMedic\")&IF(Ship!I134=0,\"\",\", \"&Ship!I134&\"xCommand\")&\")\"","v":"Crew:  (xManeuver, xElectronics)"}]
[{"$f":"\"Crew Accommodations: \"&IF(Ship!I98+Ship!I99+Ship!I101+Ship!I102+Ship!I103+Ship!I104=0,\"Cockpit\",Ship!M104&Ship!M103&Ship!M102&Ship!M101&Ship!M99&Ship!M98)","v":"Crew Accommodations: Cockpit"}]
[{"$f":"\"Passengers: \"&IF(Ship!I107>0,Ship!I107&\"xHigh, \",\"\")&IF(Ship!I106>0,Ship!I106&\"xMedium, \",\"\")&IF(Ship!I105>0,Ship!I105&\"xLow\",\"\")&IF(Ship!I106+Ship!I107+Ship!I105=0,\"None\",\"\")","v":"Passengers: None"}]
[{"$f":"\"Passenger Accommodations: \"&IF(Ship!I106+Ship!I107+Ship!I105=0,\"None\",Ship!M107&Ship!M106&Ship!M105)","v":"Passenger Accommodations: None"}]
[{"$f":"\"Other Facilities: \"&IF(Ship!I78+Ship!I79+Ship!I80+Ship!I81+Ship!I100=0,\"None\",IF(Ship!I78=0,\"\",Ship!M78&\", \")&IF(Ship!I79=0,\"\",Ship!M79&\", \")&IF(Ship!I80=0,\"\",Ship!M80&\", \")&IF(Ship!I81=0,\"\",Ship!M81)&IF(Ship!I100=0,\"\",Ship!M109))","v":"Other Facilities: , "}]
[{"$f":"\"Cargo: \"&ROUND(Ship!B91,1)&\" m3 (\"&ROUND(Ship!G91,1)&\" tons), \"&Ship!G92&\" \"&Ship!H92&IF(Ship!G67=0,\"\",\", \"&FLOOR(Ship!G67/7,1)&\" missiles in magazine\")&IF(Ship!I90=0,\"\",\", \"&ROUND(Ship!B90,1)&\" m3 fuel distribution tank\")","v":"Cargo: 0 m3 (0 tons), 0 Small Hatch"}]
[{"$f":"\"Small Craft and Launch Facilities: \"&IF(OR(SUM(Ship!I82:I87)=0,SUM(Ship!G82:G87)=6),\"None\",Ship!M82&Ship!M83&Ship!M84&Ship!M85&Ship!M86&Ship!M87)","v":"Small Craft and Launch Facilities: None"}]
[{"$f":"\"Air Locks: \"&Ship!K94","v":"Air Locks: 1"}]
[]
["Notes"]
[{"$f":"\"Total Fuel Tankage: \"&ROUND(Ship!H144,1)&\" m3 (\"&ROUND((Ship!B141)/14,1)&\" tons) \"&IF(Ship!H145=0,\"\",\"Liquid Hydrogen, \"&Ship!H145&\" m3 Radioactive\")","v":"Total Fuel Tankage: 0.2 m3 (0.2 tons) "}]
[{"$f":"IF(Ship!G76=0,\"\",\"Fuel scoops (\"&Ship!G76&\"% of ship surface), fills tanks in \"&ROUND(Ship!B141/((Ship!G76/5)*(14*Ship!B2/5)),1)&\" hours\")","v":""}]
[{"$f":"IF(Ship!G77>0,\"Fuel purification machinery (\"&Ship!D77&\"MW), \"&ROUND(6*Ship!H144/Ship!G77,1)&\" hours to refine \"&ROUND(Ship!H144,1)&\" m3.\",\"\")","v":"Fuel purification machinery (MW), 0.7 hours to refine 0.2 m3."}]
[{"$f":"IF(Ship!D144>=0,ROUND(Ship!D144,1)&\" MW power surplus\",ROUND(-1*Ship!D144,1)&\" MW power shortfall.\")","v":"1 MW power surplus"}]
[]
["Damage tables"]
["Surface Hits",null,null,"Internal Explosion",null,null,"Systems",null,"Systems",null,"Systems"]
["Air Locks",{"$f":"ROUND(Ship!E94/(Ship!E9/20),1)","v":{"$error":"#DIV/0!"}},null,"Elec",{"$f":"ROUND((Ship!B130+Ship!B131+Ship!B132+Ship!B133+Ship!B135+Ship!B136+Ship!B109+Ship!B110)/(Ship!B143/20),1)","v":0.2},null,{"$f":"\"AEMS-\"&IF(Ship!I40>1,Ship!I40&\"x\",\"\")&Hits(Ship!C40/Ship!I40)","v":{"$error":"#NAME?"}},null,{"$f":"\"LS-\"&Hits((Ship!C9+Ship!C12+Ship!C95)*2/3)","v":{"$error":"#NAME?"}},null,"LB"]
["Antenna",{"$f":"ROUND((Ship!E130+Ship!E131+Ship!E132+Ship!E133-Ship!E59)/(Ship!E9/20),1)","v":{"$error":"#DIV/0!"}},null,"Hold",{"$f":"ROUND((Ship!B91+Ship!B87+Ship!B82+Ship!B80+Ship!B79+Ship!B78)/(Ship!B143/20),1)","v":2.2000000000000002},null,{"$f":"\"AG-\"&Hits(Ship!C96)","v":{"$error":"#NAME?"}},null,{"$f":"\"LSR-\"&IF(Ship!I102>0,Ship!I102&\"x1H\",\"None\")","v":"LSR-None"},null,"LT"]
["Cargo hatch",{"$f":"ROUND(Ship!E92/(Ship!E9/20),1)","v":{"$error":"#DIV/0!"}},null,"Fuel",{"$f":"ROUND((Ship!B141)/(Ship!B143/20),1)","v":1.1000000000000001},null,{"$f":"\"AL-\"&Ship!K94&\"x1h\"","v":"AL-1x1h"},null,{"$f":"\"MD-\"&Hits(Ship!C20)","v":{"$error":"#NAME?"}},null,"MB"]
["EMM Rad",{"$f":"ROUND(Ship!E59/(Ship!E9/20),1)","v":{"$error":"#DIV/0!"}},null,"Qtrs",{"$f":"ROUND((Ship!B138-(Ship!B109+Ship!B110)+Ship!B126+Ship!B81)/(Ship!B143/20),1)","v":4.5},null,{"$f":"\"ELS-\"&Hits((Ship!C9+Ship!C12+Ship!C95)/3)","v":{"$error":"#NAME?"}},null,{"$f":"\"MFD-\"&IF(Ship!I72=0,\"None\",IF(Ship!I72>1,Ship!I72&\"x\",\"\")&Hits((Ship!C72+Ship!C73+Ship!C74)/Ship!I72))","v":"MFD-None"},null,"MG"]
["Launch ports",{"$f":"ROUND((Ship!E82+Ship!E87)/(Ship!E9/20),1)","v":{"$error":"#DIV/0!"}},null,"Eng",{"$f":"ROUND((Ship!B13+Ship!B20+Ship!B25+Ship!B76+Ship!B77)/(Ship!B143/20),1)","v":4.0999999999999996},null,{"$f":"\"EMM-\"&IF(Ship!C59>0,Hits(Ship!C59),\"None\")","v":"EMM-None"},null,{"$f":"\"MS-\"&IF(Ship!C70>0,Hits(Ship!C70),\"None\")","v":"MS-None"},null,"MT"]
["Screens",{"$f":"ROUND(Ship!E135/(Ship!E9/20),1)","v":{"$error":"#DIV/0!"}},null,"Weap",{"$f":"ROUND(Ship!B134/(Ship!B143/20),1)","v":3.3},null,{"$f":"\"EMM Rad-\"&INT(Ship!D59)&\"h\"","v":"EMM Rad-0h"},null,{"$f":"\"ND-\"&IF(Ship!C69>0,IF(Ship!I69>1,Ship!I69&\"x\",\"\")&Hits(Ship!C69/Ship!I69),\"None\")","v":"ND-None"},null,"NDB"]
["Total",{"$f":"SUM(B47:B52)","v":{"$error":"#DIV/0!"}},null,"Total",{"$f":"SUM(E47:E52)","v":15.399999999999999},null,{"$f":"\"FPP-\"&IF(Ship!G77>0,Hits(Ship!C77),\"None\")","v":{"$error":"#NAME?"}},null,{"$f":"\"PEMS-\"&IF(Ship!I42>1,Ship!I42&\"x\",\"\")&Hits(Ship!C42/Ship!I42)","v":{"$error":"#NAME?"}},null,"NDT"]
[null,null,null,null,null,null,{"$f":"\"FT-\"&Hits(Ship!B141)","v":{"$error":"#NAME?"}},null,{"$f":"\"PEMS Ant-\"&IF(Ship!I42>1,Ship!I42&\"x\",\"\")&Hits(Ship!C44/Ship!I42)","v":{"$error":"#NAME?"}},null,"PA"]
["Other Surface Locations",null,null,null,null,null,{"$f":"\"HULL-\"&Hits(Ship!C12+Ship!C9/4)","v":{"$error":"#NAME?"}},null,{"$f":"\"PP-\"&Hits(Ship!C25)","v":{"$error":"#NAME?"}},null,"TS"]
["Man drive",{"$f":"ROUND(Ship!E128/(Ship!E9/20),1)","v":{"$error":"#VALUE!"}},null,null,null,null,{"$f":"\"JD-\"&Hits(Ship!C13)","v":{"$error":"#NAME?"}},null,{"$f":"\"SSR-\"&IF(Ship!I101>0,Ship!I101&\"x2h\",\"None\")","v":"SSR-None"}]
["Jump drive",{"$f":"ROUND(Ship!E127/(Ship!E9/20),1)","v":{"$error":"#DIV/0!"}},null,null,null,null,{"$f":"\"LBth-\"&IF(Ship!I99>0,Ship!I99&\"x1h\",\"None\")","v":"LBth-None"}]
["Weapons",{"$f":"ROUND((Ship!E134+Ship!E136)/(Ship!E9/20),1)","v":{"$error":"#DIV/0!"}}]
["Total",{"$f":"SUM(B56:B58)","v":{"$error":"#VALUE!"}}]
[]
[]
["Battle Rider Starship Data"]
["Spinal",null,null,{"$f":"-1*(FLOOR(LOG(Ship!B2),1)-1)","v":1},"Size"]
["Bay",null,null,{"$f":"\"TL-\"&IF(Ship!K143=Ship!K144,Ship!K143,Ship!K143&\"/\"&Ship!K144)","v":"TL-8/14"},"Tech Level"]
["Barbette",null,null,{"$f":"\"FC:-\"&IF(Ship!I72>0,Ship!G73,0)","v":"FC:-0"},"Fire Control"]
["Turret",null,null,null,"Missiles"]
["Sensors",{"$f":"\"A:\"&INDEX(Tables!Q143:Q157,Ship!H40)&IF(Ship!H44=\"Folding\",\" [P:\"&INDEX(Tables!P181:P194,Ship!H42)&\"]\",\" P:\"&INDEX(Tables!P181:P194,Ship!H42))&IF(Ship!I53>0,\" J:\"&INDEX(Tables!Q143:Q157,Ship!H53),\"\")&IF(Ship!G59=3,\" Msk\",\"\")","v":"A:0 P:0"},null,{"$f":"IF(Ship!G76>0,\"S\",\"\")&IF(Ship!G77>0,\"P\",\"\")&\" J\"&Ship!F1&\" G\"&Ship!I20","v":"P J G0"},"Maneuver"]
["Structural",{"$f":"\"AV:\"&BattleRider(Ship!I9)","v":{"$error":"#NAME?"}},null,null,"Battle Riders"]
["Screens",{"$f":"IF(AND(Ship!I70>0,BattleRider(Ship!G70)>0),\"MS:\"&BattleRider(Ship!G70)&\" \",\"\")&IF(Ship!I66>0,\"SC:\"&Ship!I66&\" \",\"\")","v":{"$error":"#NAME?"}},null,{"$f":"FLOOR(SQRT(Ship!B2/1000)*((Ship!K143+Ship!K144)/2),1)","v":0},"Point Value"]

{"sheet":"T4 Data","index":4,"n_rows":39,"n_cols":7,"rows_kept":39,"cut":false,"hidden":false,"merged":[]}
["T4 Starship Data"]
["Ship or Class Name and Type"]
[]
[{"$f":"\"Tons: \"&Ship!B2&\" (\"&INDEX(Tables!A3:A22,Ship!B3)&\" \"&INDEX(Tables!R1:R3,Ship!B4)&\")\"","v":{"$error":"#REF!"}},null,null,{"$f":"\"Volume: \"&14*Ship!B2&\" m3\"","v":"Volume: 67.2 m3"},null,null,{"$f":"\"Cost: \"&ROUND(Ship!F143,3)&\" MCr\"","v":"Cost: 0.68 MCr"}]
[{"$f":"\"Crew: \"&Ship!I140","v":"Crew: "},null,null,{"$f":"\"High/Mid Pass: \"&Ship!I106+Ship!I107","v":"High/Mid Pass: 0"},null,null,{"$f":"\"Low Pass: \"&Ship!G105","v":"Low Pass: Low passengers"}]
[{"$f":"\"Cargo: \"&Ship!G91&\" tons\"","v":"Cargo: 0 tons"},null,null,{"$f":"\"Controls: \"&IF(Ship!G32=1,\"Std\",\"Fib\")&IF(Ship!I109>0,\"(Bridge)\",\"\")","v":"Controls: Std"},null,null,{"$f":"\"TL: \"&Ship!K143&\"/\"&Ship!K144","v":"TL: 8/14"}]
[]
[{"$f":"FLOOR(LOG(Ship!B2),1)+6&\" Size\"","v":"6 Size"},null,null,{"$f":"IF(Ship!F1=\"\",\"0 Jump drive\",Ship!F1&\" Jump Drive (\"&ROUND((Ship!B16/14)/Ship!F1,1)&\" tons/Pc Fuel)\")","v":"0 Jump drive"}]
[{"$f":"IF(Ship!I72>0,Ship!G73,0)&\" Fire Control\"","v":"0 Fire Control"},null,null,{"$f":"Ship!I20&\" Maneuver (\"&INDEX(Tables!B287:B294,Ship!G20)&\", \"&Ship!D20&\" MW)\"&IF(AND(G20=1,Ship!G21=1),\", No ASD\",\"\")","v":"0 Maneuver (None, 0 MW)"}]
[null,null,null,{"$f":"ROUND(Ship!D25*2/Ship!B2,1)&\" Power Plant (\"&Ship!D25&\" MW)\"","v":"0.6 Power Plant (1.4 MW)"}]
[null,null,null,{"$f":"ROUND(Ship!B141/14,1)&\" Fuel \"&IF((Ship!G76+Ship!G77)=0,\"\",\"(\"&IF(Ship!G76=0,\"\",\"Scoop \"&(Ship!G76/5)*(14*Ship!B2/5)/14)&IF(Ship!G77=0,\"\",IF(Ship!G76=0,\"\",\",\")&\" Refine \"&ROUND(Ship!G77/(14*6),1))&\")\")","v":"0.2 Fuel ( Refine 0)"}]
[null,null,null,{"$f":"IF(Ship!I70=0,0,BattleRider(Ship!G70))&\" Meson Screen (\"&Ship!D70&\" MW)\"","v":"0 Meson Screen (0 MW)"}]
[null,null,null,{"$f":"IF(OR(Ship!G66=8,Ship!G66=9),Ship!I66,0)&\" Sandcasters (\"&0&\" cans)\"","v":"0 Sandcasters (0 cans)"}]
[{"$f":"IF(Ship!I82=0,\"\",Ship!I82&\"x\"&INDEX(Tables!I223:I230,Ship!G82)&\" (\"&Ship!K82&\"-ton)\")","v":""},null,null,{"$f":"Ship!I69&\" Nuclear Damper\"","v":"0 Nuclear Damper"}]
[{"$f":"IF(Ship!I87=0,\"\",Ship!I87&\"x\"&INDEX(Tables!I223:I230,Ship!G87)&\" (\"&Ship!K87&\"-ton)\")","v":""},null,null,{"$f":"INDEX(Tables!Q143:Q157,Ship!H40)&\"A \"&INDEX(Tables!P181:P194,Ship!H42)&\"P \"&IF(Ship!I53>0,INDEX(Tables!Q143:Q157,Ship!H53),0)&\"J \"&\"Sensors\"&IF(Ship!G59>1,\"/\"&INDEX(Tables!F199:F201,Ship!G59),\"\")","v":"0A 0P 0J Sensors"}]
[null,null,null,{"$f":"BattleRider(Ship!I9)*10&\" Armor, \"&BattleRider(Ship!B2*Ship!I11)&\" Structure\"","v":{"$error":"#NAME?"}}]
[]
[{"$f":"\"Crew: \"&Ship!I127&\" Maneuver, \"&Ship!I128&\" Electronics\"&IF(Ship!I129=0,\"\",\", \"&Ship!I129&\" Engineer\")&IF(Ship!I131=0,\"\",\", \"&Ship!I131&\" Gunnery\")&IF(Ship!I130=0,\"\",\", \"&Ship!I130&\" Maintenance\")& IF(Ship!I133=0,\"\",\", \"&Ship!I133&\" Ship's Troops\")&IF(Ship!I132=0,\"\",\", \"&Ship!I132&\" Flight\")&IF(Ship!I136=0,\"\",\", \"&Ship!I136&\" Steward\")& IF(Ship!I137=0,\"\",\", \"&Ship!I137&\" Medic\")&IF(Ship!I134=0,\"\",\", \"&Ship!I134&\" Command\")","v":"Crew:  Maneuver,  Electronics"}]
[{"$f":"\"Accom: \"&IF(Ship!I102=0,\"\",Ship!I102&\" large staterooms, \")&IF(Ship!I101=0,\"\",Ship!I101&\" small staterooms, \")&IF(Ship!I98=0,\"\",Ship!I98&\" bunks, \")&IF(Ship!I99=0,\"\",Ship!I99&\" low berths, \")&IF(Ship!I100=0,\"\",Ship!I100&\" emergency low berths, \")&IF(Ship!I97=0,\"\",Ship!I97&\" G tanks\")","v":"Accom: "}]
[{"$f":"\"Average density: \"&ROUND(Ship!F5,3)&\" ton/m3\"&IF(Ship!F5<1,\", the ship will float on water.\",\".\")","v":"Average density: 1 ton/m3."}]
[]
["Economy analysis",null,"(one month basis, 2 jumps)"]
[]
["Down payment",null,{"$f":"1000000*Ship!F143/5","v":136062.90666666668}]
[]
["Monthly payments",null,{"$f":"1000000*Ship!F143/240","v":2834.6438888888888},"(bank loan, 20 years)"]
["Maintenance",null,{"$f":"1000000*Ship!F143/12000","v":56.692877777777774}]
["Crew salaries",null,{"$f":"Ship!I129*4000 + Ship!I128*5000 + IF(Ship!I127=1,6000,6000+5000) + Ship!I131*1000 +Ship!I130*500+ Ship!I133*500+ Ship!I132*1000+Ship!I134*8000+Ship!I136*500+Ship!I137*2000","v":11000}]
["Life support",null,{"$f":"2* (2000*Ship!I101 + 100*Ship!I99)","v":0}]
["Fuel",null,{"$f":"IF(Ship!G77>0,\"100\",\"500\")*(Ship!B141/14)","v":23.999999999999996},{"$f":"IF(Ship!G77>0,\"(unrefined)\",\"(refined)\")","v":"(unrefined)"}]
["Total costs",null,{"$f":"SUM(C26:C30)","v":13915.336766666667}]
[]
["Cargo",null,{"$f":"2 * (4000*Ship!G91)","v":0}]
["Passengers",null,{"$f":"2 * (Ship!I107*10000 + Ship!I106*8000 + Ship!I105*1000)","v":0}]
["Total income",null,{"$f":"SUM(C33:C34)","v":0}]
[]
["Maximum profit",null,{"$f":"C35-C31","v":-13915.336766666667}]
[]
[{"$f":"IF(C37>0,\"Assuming full cargo for each jump, the ship will earn its purchase price in \"&FLOOR(IF(C42>20,20+((Ship!F143*1000000-240*C37)/(C35-SUM(C27:C30)))/12,(Ship!F143*1000000/C37)/12),1)&\" years and \"&IF(C42>20,CEILING((20+((Ship!F143*1000000-240*C37)/(C35-SUM(C27:C30)))/12-FLOOR(20+((Ship!F143*1000000-240*C37)/(C35-SUM(C27:C30)))/12,1))*12,1),CEILING(((Ship!F143*1000000/C37)/12-FLOOR((Ship!F143*1000000/C37)/12,1))*12,1))&\" months.\",\"This ship is not ecomically feasible.\")","v":"This ship is not ecomically feasible."}]

{"sheet":"HTML","index":5,"n_rows":100,"n_cols":1,"rows_kept":100,"cut":false,"hidden":false,"merged":[]}
["<HTML><HEAD><TITLE>"]
[{"$f":"Ship!F2&\"-Class \"&INDEX(Tables!O1:O27,Ship!F3)","v":"M1A5-Class Troop Transport"}]
["</TITLE></HEAD>"]
["<BODY BGCOLOR=\"DDDDDD\" TEXT=\"111111\" LINK=\"0000AA\" VLINK=\"440000\">"]
["<CENTER>"]
["<IMG SRC=\"../../graphics/bardicon.gif\" HEIGHT=75 WIDTH=75 ALIGN=LEFT ALT=\"BARD Icon\">"]
["<IMG SRC=\"../../graphics/bardicon.gif\" HEIGHT=75 WIDTH=75 ALIGN=RIGHT ALT=\"BARD Icon\">"]
["<TT>BARD PAPER: SARA5xxx</TT> <P>"]
["| <A HREF=\"../../roberts.html\"> Home </A> "]
["| <A HREF=\"../../traveller.html\"> Traveller </A> "]
["| <A HREF=\"../../bard.html/\"> BARD </A>"]
["| <A HREF=\"../bardsara.html\"> SARA </A>"]
["|"]
["<HR>"]
[{"$f":"\"<FONT SIZE=6><I>\"&Ship!F2&\"</I>-Class \"&INDEX(Tables!O1:O28,Ship!F3)&\"</FONT><P>\"","v":"<FONT SIZE=6><I>M1A5</I>-Class Troop Transport</FONT><P>"}]
["<FONT SIZE=2>design by <A HREF=\"../../credits.html#Name of designer\">Name of designer</A></FONT><P>"]
["</CENTER>"]
["<HR> "]
["Description of the ship"]
["<HR><P><BR>"]
[{"$f":"\"<FONT SIZE=5><I>\"&Ship!F2&\"</I>-Class \"&INDEX(Tables!O1:O27,Ship!F3)&\"</FONT><P>\"","v":"<FONT SIZE=5><I>M1A5</I>-Class Troop Transport</FONT><P>"}]
[]
["<H4>General Data</H4>"]
["<TABLE WIDTH=100%>"]
["<TR>"]
[{"$f":"\"<TD ALIGN=LEFT><B>Displacement:</B> \"&TEXT(Ship!B2,CHOOSE(ROUNDDOWN(LOG(Ship!B2)/3,0)+1,\"0\",\"0,000\",\"0,000,000\",\"0,000,000,000\"))&IF(Ship!B148>0,\"/\"&TEXT(Ship!B2+ROUND(Ship!B148/14,0),CHOOSE(ROUNDDOWN(LOG(Ship!B2+ROUND(Ship!B148/14,0))/3,0)+1,\"0\",\"0,000\",\"0,000,000\",\"0,000,000,000\")),\"\")&\" tons</TD>\"","v":"<TD ALIGN=LEFT><B>Displacement:</B> 5 tons</TD>"}]
[{"$f":"\"<TD ALIGN=LEFT><B>Hull Armor:</B> \"&TEXT(Ship!I9,CHOOSE(FLOOR(LOG(Ship!I9)/3,1)+1,\"0\",\"0,000\",\"0,000,000\"))&\"</TD>\"","v":{"$error":"#NUM!"}}]
["</TR>"]
["<TR>"]
[{"$f":"\"<TD ALIGN=LEFT><B>Length:</B> \"&Ship!L1&\" meters</TD>\"","v":"<TD ALIGN=LEFT><B>Length:</B> 6.78 meters</TD>"}]
[{"$f":"\"<TD ALIGN=LEFT><B>Volume:</B> \"&TEXT(14*Ship!B2,CHOOSE(FLOOR(LOG(14*Ship!B2)/3,1)+1,\"0\",\"0,000\",\"0,000,000\",\"0,000,000,000\"))&IF(Ship!B148>0,\"/\"&TEXT(Ship!B2*14+ROUND(Ship!B148,0),CHOOSE(FLOOR(LOG(Ship!B2*14+ROUND(Ship!B148,0))/3,1)+1,\"0\",\"0,000\",\"0,000,000\",\"0,000,000,000\")),\"\")&\" m<SUP>3</SUP></TD>\"","v":"<TD ALIGN=LEFT><B>Volume:</B> 67 m<SUP>3</SUP></TD>"}]
["</TR>"]
["<TR>"]
[{"$f":"\"<TD ALIGN=LEFT><B>Price:</B> \"&IF(Ship!F143<1000,ROUND(Ship!F143,2)&\" MCr\",ROUND(Ship!F143/1000,2)&\" GCr\")&\"</TD>\"","v":"<TD ALIGN=LEFT><B>Price:</B> 0.68 MCr</TD>"}]
[{"$f":"\"<TD ALIGN=LEFT><B>Target Size:</B> \"&SizeCode(Ship!B2)&\" </TD>\"","v":{"$error":"#NAME?"}}]
["</TR>"]
["<TR>"]
[{"$f":"\"<TD ALIGN=LEFT><B>Configuration:</B>\"&INDEX(Tables!Q1:Q3,Ship!B4)&\" \"&INDEX(Tables!A3:A22,Ship!B3)&\"</TD>\"","v":{"$error":"#REF!"}}]
[{"$f":"\"<TD ALIGN=LEFT><B>Tech Level:</B> \"&IF(Ship!K143=Ship!K144,Ship!K143,Ship!K143&\" / \"&Ship!K144)&\"</TD>\"","v":"<TD ALIGN=LEFT><B>Tech Level:</B> 8 / 14</TD>"}]
["</TR>"]
["<TR>"]
[{"$f":"\"<TD ALIGN=LEFT COLSPAN=2><B>Mass (Loaded/Unloaded):</B> \"&TEXT(Ship!C143,CHOOSE(FLOOR(LOG(Ship!C143)/3,1)+1,\"0.0\",\"0,000.0\",\"0,000,000.0\",\"0,000,000,000.0\"))&\" / \"&TEXT(Ship!C143-(Ship!C141+Ship!C91),CHOOSE(FLOOR(LOG(Ship!C143-(Ship!C141+Ship!C91))/3,1)+1,\"0.0\",\"0,000.0\",\"0,000,000.0\",\"0,000,000,000.0\"))&\"</TD>\"","v":"<TD ALIGN=LEFT COLSPAN=2><B>Mass (Loaded/Unloaded):</B> 62.6 / 62.4</TD>"}]
["</TR>"]
["</TABLE>"]
["<P><BR>"]
["<DL><H4>Engineering Data</H4>"]
[{"$f":"\"<DD><B>Power Plant:</B> \"&IF(Ship!D25<1000,Ship!D25&\" MW \",ROUND(Ship!D25/1000,2)&\" GW \")&VLOOKUP(Ship!G25,Tables!A243:H247,2)&\" Power Plant, \"&Ship!I26&\" year duration (\"&TEXT(Ship!B26,CHOOSE(FLOOR(LOG(Ship!B26)/3,1)+1,\"0.0\",\"0,000.0\",\"0,000,000.0\",\"0,000,000,000.0\"))&\" m<SUP>3</SUP> fuel)\"","v":"<DD><B>Power Plant:</B> 1.4 MW N/A Power Plant, 12 year duration (3.4 m<SUP>3</SUP> fuel)"}]
[{"$f":"\"<DD><B>Jump Performance:</B> \"&IF(Ship!F1=\"\",\"None\",Ship!F1&\" (\"&TEXT(Ship!B16,CHOOSE(FLOOR(LOG(Ship!B16)/3,1)+1,\"0\",\"0,000\",\"0,000,000\",\"0,000,000,000\"))&\" m<SUP>3</SUP> fuel)\")","v":"<DD><B>Jump Performance:</B> None"}]
[{"$f":"\"<DD><B>G-Rating: \"&Ship!M20&Ship!M21&Ship!M19","v":"<DD><B>G-Rating: "}]
[{"$f":"\"<DD><B>G-Turns:</B> \"&IF(Ship!B22=0,\"None\",Ship!I22)&IF(AND(Ship!B22>0,Ship!F1>0),\" (\"&Ship!M12&Ship!M13&Ship!M14&Ship!M15&Ship!M16&Ship!M18&\")\",\"\")&IF(Ship!B22=0,\"\",\", \"&TEXT(Ship!B22/Ship!I22,CHOOSE(ROUNDDOWN(LOG(Ship!B22/Ship!I22)/3,0)+1,\"0.0\",\"0,000.0\",\"0,000,000.0\",\"0,000,000,000.0\"))&\" m<SUP>3</SUP> fuel each\")","v":{"$error":"#DIV/0!"}}]
[{"$f":"\"<DD><B>Maint:</B> \"&TEXT(Ship!H141,CHOOSE(FLOOR(LOG(Ship!H141)/3,1)+1,\"0\",\"0,000\",\"0,000,000\",\"0,000,000,000\"))","v":"<DD><B>Maint:</B> 7"}]
["</DL><P>"]
["<DL><H4>Electronics</H4>"]
[{"$f":"\"<DD><B>Computer:</B> \"&IF(Ship!I32=0,\"\",Ship!M32)&IF(Ship!I33=0,\"\",\", \"&Ship!M33)","v":"<DD><B>Computer:</B> "}]
[{"$f":"\"<DD><B>Commo:</B> \"&Ship!M35&IF(Ship!M35=\"\",\"\",\", \")&Ship!M36&IF(Ship!M36=\"\",\"\",\", \")&Ship!M37&IF(Ship!M37=\"\",\"\",\", \")&Ship!M38","v":"<DD><B>Commo:</B> Laser (30 km; 0.01 MW), Radio (300 km; 0.01 MW)"}]
[{"$f":"\"<DD><B>Avionics:</B> \"&Ship!M29&Ship!M31&Ship!M30","v":"<DD><B>Avionics:</B> , Satellite positioning"}]
[{"$f":"\"<DD><B>Sensors:</B> \"&Ship!M40&IF(Ship!M40=\"\",\"\",\", \")&Ship!M42&IF(Ship!M42=\"\",\"\",\", \")&Ship!M46&IF(Ship!M46=\"\",\"\",\", \")&Ship!M48&IF(Ship!M48=\"\",\"\",\", \")&Ship!M49&IF(Ship!M49=\"\",\"\",\", \")&Ship!M50","v":"<DD><B>Sensors:</B> "}]
[{"$f":"\"<DD><B>ECM/ECCM:</B> \"&IF(AND(Ship!I52+Ship!I53+Ship!I54=0,Ship!G59=1),\"None\",Ship!M52&IF(Ship!M52=\"\",\"\",\", \")&Ship!M53&IF(Ship!M53=\"\",\"\",\", \")&Ship!M54&IF(Ship!M54=\"\",\"\",\", \")&Ship!M58&IF(Ship!M58=\"\",\"\",\", \")&Ship!M59)","v":"<DD><B>ECM/ECCM:</B> None"}]
[{"$f":"\"<DD><B>Controls:</B> \"&IF(Ship!I109=0,\"No bridge, \",\"Bridge with \"&Ship!I109&\" bridge workstations, \")&Ship!I110&\" normal workstations, \"&Ship!M108&\", \"&INDEX(Ship!O121:O123,Ship!G28)","v":"<DD><B>Controls:</B> No bridge, 0 normal workstations, , Standard Automation"}]
["</DL><P>"]
["<DL><H4>Armament</H4>"]
[{"$f":"\"<DD><B>Offensive:</B> \"&IF(Ship!I61+Ship!I62+Ship!I63+Ship!I64+Ship!I65=0,\"None\",Ship!M61&IF(Ship!M62=\"\",\"\",\"<BR>\")&Ship!M62&IF(Ship!M63=\"\",\"\",\"<BR>\")&Ship!M63&IF(Ship!M64=\"\",\"\",\"<BR>\")&Ship!M64&IF(Ship!M65=\"\",\"\",\"<BR>\")&Ship!M65)&\"<BR>\"","v":"<DD><B>Offensive:</B> 3<BR>3<BR>3<BR>3<BR>4<BR>"}]
[{"$f":"\"<DD><B>Defensive:</B> \"&IF(Ship!I66+Ship!I69+Ship!I70=0,\"None\",\"\")&IF(Ship!M66=\"\",\"\",Ship!M66&\"<BR>\")&IF(Ship!M69=\"\",\"\",Ship!M69&\"<BR>\")&IF(Ship!M70=\"\",\"\",\"TL-\"&Ship!K70&\" \"&Ship!M70&\"<BR>\")","v":"<DD><B>Defensive:</B> None4<BR>"}]
[{"$f":"\"<DD><B>Master Fire Directors:</B> \"&IF(Ship!I72=0,\"None\",Ship!M72&IF(Ship!M72=\"\",\"\",\", \")&Ship!M74)","v":"<DD><B>Master Fire Directors:</B> None"}]
["</DL>"]
["<DD><TABLE BORDER=0>"]
["<TR>"]
["<TD WIDTH=200>Name</TD><TD WIDTH=80>Short</TD><TD WIDTH=80>Medium</TD><TD WIDTH=80>Long</TD><TD WIDTH=80>Extreme</TD>"]
["</TR><TR BGCOLOR=#BBBBBBBB>"]
[{"$f":"\"<TD>\"&INDEX(WTables!A123:A136,Ship!G61)&\"</TD><TD>\"&INDEX(WTables!H123:H136,Ship!G61)&\"</TD><TD>\"&INDEX(WTables!I123:I136,Ship!G61)&\"</TD><TD>\"&INDEX(WTables!J123:J136,Ship!G61)&\"</TD><TD>\"&INDEX(WTables!K123:K136,Ship!G61)&\"</TD>\"","v":"<TD>100/L60 Autogun</TD><TD>490/650 </TD><TD>980/1300</TD><TD>1960/2600</TD><TD>3920/5200</TD>"}]
["</TR><TR>"]
[{"$f":"\"<TD>\"&INDEX(Tables!B376:B391,Ship!G62)&\"</TD><TD>\"&INDEX(Tables!K376:K390,Ship!G62)&\"</TD><TD>\"&INDEX(Tables!L376:L390,Ship!G62)&\"</TD><TD>\"&INDEX(Tables!M376:M390,Ship!G62)&\"</TD><TD>\"&INDEX(Tables!N376:N390,Ship!G62)&\"</TD>\"","v":"<TD></TD><TD></TD><TD></TD><TD>40:1/2-7</TD><TD>80:1-4</TD>"}]
["</TR>"]
["</TABLE>"]
["<DL><H4>Accommodations</H4>"]
[{"$f":"\"<DD><B>Life Support:</B> \"&Ship!L95&\" (\"&ROUND(Ship!D95,2)&\" MW), Gravitic Compensators (\"&IF(ROUND(Ship!D96,2)<1000,ROUND(Ship!D96,2)&\" MW)\",ROUND(Ship!D96/1000,2)&\" GW)\")","v":"<DD><B>Life Support:</B> m3 LS volume (0 MW), Gravitic Compensators (0 MW)"}]
[{"$f":"\"<DD><B>Grav Compensation:</B> \"&MIN(Ship!K93-9,9)&\" G.\"","v":"<DD><B>Grav Compensation:</B> 5 G."}]
[{"$f":"\"<DD><B>Crew:</B> \"&Ship!I140&\" (\"&Ship!I127&\"xManeuver\"&\", \"&Ship!I128&\"xElectronics\"&IF(Ship!I129=0,\"\",\", \"&Ship!I129&\"xEngineer\")&IF(Ship!I131=0,\"\",\", \"&Ship!I131&\"xGunnery\")&IF(Ship!I130=0,\"\",\", \"&Ship!I130&\"xMaintenance\")& IF(Ship!I133=0,\"\",\", \"&Ship!I133&\"xShip's Troops\")&IF(Ship!I132=0,\"\",\", \"&Ship!I132&\"xFlight\")&IF(Ship!I136=0,\"\",\", \"&Ship!I136&\"xSteward\")& IF(Ship!I137=0,\"\",\", \"&Ship!I137&\"xMedic\")&IF(Ship!I134=0,\"\",\", \"&Ship!I134&\"xCommand\")&\")\"","v":"<DD><B>Crew:</B>  (xManeuver, xElectronics)"}]
[{"$f":"\"<DD><B>Crew Accommodations:</B> \"&IF(Ship!I98+Ship!I99+Ship!I101+Ship!I102+Ship!I103+Ship!I104=0,\"Cockpit\",Ship!M104&Ship!M103&Ship!M102&Ship!M101&Ship!M99&Ship!M98)","v":"<DD><B>Crew Accommodations:</B> Cockpit"}]
[{"$f":"IF(Ship!I106+Ship!I107+Ship!I105=0,\"\",\"<DD><B>Passenger Accommodations:</B> \"&Ship!M107&Ship!M106&Ship!M105)","v":""}]
[{"$f":"IF(Ship!I78+Ship!I79+Ship!I80+Ship!I81+Ship!I100=0,\"\",\"<DD><B>Other Facilities:</B> \"&IF(Ship!I78=0,\"\",Ship!M78&\", \")&IF(Ship!I79=0,\"\",Ship!M79&\", \")&IF(Ship!I80=0,\"\",Ship!M80&\", \")&IF(Ship!I81=0,\"\",Ship!M81)&IF(Ship!I100=0,\"\",Ship!M109))","v":"<DD><B>Other Facilities:</B> , "}]
[{"$f":"\"<DD><B>Cargo:</B> \"&IF(Ship!B91=0,\"None\",ROUND(Ship!B91,1)&\" m3 (\"&ROUND(Ship!G91,1)&\" tons), \"&Ship!G92&\" \"&Ship!H92)&IF(Ship!G67=0,\"\",\", \"&FLOOR(Ship!G67/7,1)&\" missiles in magazine\")&IF(Ship!I90=0,\"\",\", \"&ROUND(Ship!B90,1)&\" m3 fuel distribution tank\")","v":"<DD><B>Cargo:</B> None"}]
[{"$f":"\"<DD><B>Small Craft and Launch Facilities:</B> \"&IF(OR(SUM(Ship!I82:I87)=0,SUM(Ship!G82:G87)=6),\"None\",Ship!M82&Ship!M83&Ship!M84&Ship!M85&Ship!M86&Ship!M87)","v":"<DD><B>Small Craft and Launch Facilities:</B> None"}]
[{"$f":"\"<DD><B>Air Locks:</B> \"&Ship!K94","v":"<DD><B>Air Locks:</B> 1"}]
["</DL><P>"]
["<H4>Notes</H4>"]
[{"$f":"\"Total Fuel Tankage: \"&TEXT(Ship!H144,CHOOSE(FLOOR(LOG(Ship!H144)/3,1)+1,\"0.0\",\"0,000.0\",\"0,000,000.0\",\"0,000,000,000.0\"))&\" m3 (\"&TEXT(Ship!B141/14,CHOOSE(FLOOR(LOG(Ship!B141/14)/3,1)+1,\"0.0\",\"0,000.0\",\"0,000,000.0\",\"0,000,000,000.0\"))&\" tons)\"&IF(Ship!H145=0,\"\",\" Liquid Hydrogen, \"&Ship!H145&\" m3 Radioactive\")&\".<BR>\"","v":{"$error":"#VALUE!"}}]
[{"$f":"IF(Ship!G76=0,\"\",\"Fuel scoops (\"&Ship!G76&\"% of ship surface), fills tanks in \"&ROUND(Ship!B141/((Ship!G76/5)*(14*Ship!B2/5)),2)&\" hours.<BR>\")","v":""}]
[{"$f":"IF(Ship!G77>0,\"Fuel purification machinery (\"&IF(Ship!D77<1000,Ship!D77&\"MW), \",ROUND(Ship!D77/1000,2)&\"GW), \")&ROUND(6*Ship!H144/Ship!G77,2)&\" hours to refine \"&TEXT(Ship!H144,CHOOSE(FLOOR(LOG(Ship!H144)/3,1)+1,\"0.0\",\"0,000.0\",\"0,000,000.0\",\"0,000,000,000.0\"))&\" m3.<BR>\",\"\")","v":{"$error":"#VALUE!"}}]
[{"$f":"\"Crew requirements are calculated by using '\"&INDEX(Tables!H358:H360,Ship!I125)&\"' crew model.<BR>\"","v":"Crew requirements are calculated by using 'FFS2' crew model.<BR>"}]
[{"$f":"IF(Ship!D144>=0,ROUND(Ship!D144,1)&\" MW power surplus\",ROUND(-1*Ship!D144,1)&\" MW power shortfall.\")","v":"1 MW power surplus"}]
["<P>"]
["<HR>"]
["<H3>Damage Tables</H3>"]
["<PRE>"]
["</PRE>"]
["<HR>"]
["&reg;1996. Traveller is a registered trademark of FarFuture Enterprises. All rights reserved.<BR>"]
["BARD Logo Copyright &copy;1996 by Lawrence C. Cox.<BR>"]
["</BODY></HTML>"]

{"sheet":"WTables","index":6,"n_rows":171,"n_cols":15,"rows_kept":171,"cut":false,"hidden":false,"merged":[]}
["Name","Displac","Lenght (m)","Width (m)","Area (m2)","Price","Type","ROF","Diff Mod","Vol Mod","FA Mult"]
["turret",3,4.2,3.6,10,0.09,"C-PAW",10,0,1,1,"T"]
["barbette",6,5.25,4.5,16,0.1,"N-PAW",50,1,1,1,"B"]
["small bay",50,{"$f":"ROUND(1.4*(B4*14)^(1/3),0)","v":12},{"$f":"5*ROUND(SQRT(B4*14/C4)/5,1)","v":7.5},{"$f":"C4*D4","v":90},"manned","tunable",100,2,1,1,"S"]
["large bay",100,{"$f":"ROUND(1.4*(B5*14)^(1/3),0)","v":16},{"$f":"5*ROUND(SQRT(B5*14/C5)/5,1)","v":9.5},{"$f":"C5*D5","v":152},"remote","x-ray",200,3,1.3,2,"L"]
["custom bay",200,{"$f":"ROUND(1.4*(B6*14)^(1/3),0)","v":20},{"$f":"5*ROUND(SQRT(B6*14/C6)/5,1)","v":12},{"$f":"C6*D6","v":240},"M","gravitic focus",400,4,1.7,4,"C"]
["spinal","Unlimited","Unlimited","Unlimited","Unlimited","R","non-gravitic",800,5,2.2000000000000002,8,"X"]
[]
["Tech Level","Len Mult","C-PAW","N-PAW","Mass Mult","HPG","Beam Poi","Contr Mult","Workstat","Len Mult","Vol Mult","Mass Mult"]
[8,0.12,1,0,1.2,0.125,3,0.6,7.5000000000000002E-4,"N/A","N/A","N/A"]
[9,0.14000000000000001,1,1,1,0.1,1.5,0.5,1E-3,"N/A","N/A","N/A"]
[10,0.16,2,1,1,0.08,1.5,0.45,1.5E-3,"N/A","N/A","N/A"]
[11,0.2,3,2,0.75,0.06,1.5,0.4,1.5E-3,0.8,0.02,1]
[12,0.25,3,3,0.75,0.05,1,0.35,1.5E-3,1,0.01,0.75]
[13,0.3,4,3,0.75,4.4999999999999998E-2,1,0.3,2E-3,1,0.01,0.75]
[14,0.5,4,4,0.75,0.04,0.6,0.25,2E-3,1.2,0.01,0.6]
[15,1,5,4,0.75,3.5000000000000003E-2,0.3,0.2,2E-3,1.2,0.01,0.6]
[16,1.25,5,5,0.6,0.03,0.3,0.15,2E-3,1.4,5.0000000000000001E-3,0.5]
[17,1.3,5,5,0.5,2.5000000000000001E-2,0.15,0.13,2.5000000000000001E-3,1.4,5.0000000000000001E-3,0.5]
[18,1.4,6,5,0.4,0.02,0.15,0.11,2.5000000000000001E-3,1.5,5.0000000000000001E-3,0.4]
[19,1.5,6,6,0.4,1.4999999999999999E-2,0.08,0.09,2.5000000000000001E-3,1.5,5.0000000000000001E-3,0.4]
[20,1.6,6,6,0.3,0.01,null,7.0000000000000007E-2,2.5000000000000001E-3,1.6,2E-3,0.3]
[21,1.7,6,6,0.3,5.0000000000000001E-3,null,0.05,3.0000000000000001E-3,1.6,2E-3,0.3]
[22,1.8,7,6,0.2,null,null,null,3.0000000000000001E-3,1.8,2E-3,0.2]
[23,1.9,7,7,0.2,null,null,null,3.0000000000000001E-3,1.8,2E-3,0.2]
[24,2,7,7,0.1,null,null,null,3.0000000000000001E-3,2,1E-3,0.1]
[]
[null,"Atmosph","C-PAW","N-PAW","VL-IR Las","UV-GR Las"]
[1,"Vacuum",1E-3,1,1,1]
[2,"Trace",5.0000000000000001E-3,1,1,0.9]
[3,"Very Thin",0.01,0.1,0.5,0.1]
[4,"Thin",0.05,0.02,0.2,0.02]
[5,"Standard",0.1,0.01,0.1,0.01]
[6,"Dense",0.1,5.0000000000000001E-3,0.05,5.0000000000000001E-3]
[7,"Exotic",0.05,1E-3,0.01,1E-3]
[]
[null,"HFA Vol","LFA Vol","Efficiency","Hvy Mult","Hvy Pow","Lt Mult","Lt Pow","RF","XR Mult"]
[7,1,10,0.2,1,1,1,1,3,"N/A"]
[8,1,10,0.25,1,1,1,1,20,"N/A"]
[9,0.1,1,0.3,1,2,1,1,33,"N/A"]
[10,0.01,1,0.35,3,2,1,2,50,"N/A"]
[11,0.01,1,0.45,4,2,3,2,100,"N/A"]
[12,1E-3,0.5,0.55000000000000004,5,2,4,2,100,"N/A"]
[13,1E-3,0.5,0.65,6,2,5,2,100,4]
[14,1E-3,0.5,0.75,6,2,6,2,100,5]
[15,1E-3,0.5,0.85,6,2,6,2,1000,6]
[16,5.0000000000000001E-4,0.1,0.95,6,2,6,2,2000,6]
[17,5.0000000000000001E-4,0.1,0.95,6,2,6,2,5000,6]
[18,5.0000000000000001E-4,0.1,0.95,6,2,6,2,10000,6]
[19,5.0000000000000001E-4,0.1,0.95,6,2,6,2,50000,6]
[20,1E-4,0.05,0.95,6,2,6,2,100000,"N/A"]
[21,1E-4,0.05,0.95,6,2,6,2,200000,"N/A"]
[22,1E-4,0.05,0.95,6,2,6,2,500000,"N/A"]
[23,1E-4,0.05,0.95,6,2,6,2,1000000,"N/A"]
[]
[null,"Tunable","X-ray"]
[1,{"$f":"((VLOOKUP(Laser!B1,WTables!A38:I54,5)*(Laser!F2*10))^VLOOKUP(Laser!B1,WTables!A38:I54,6))*0.1*VLOOKUP(Laser!B1,WTables!A38:I54,9)/30000","v":3.3333333333333335},{"$f":"((VLOOKUP(Laser!B1,WTables!A38:J54,10)*(Laser!F2*10))^2)*0.1*100000/30000","v":{"$error":"#VALUE!"}}]
[2,{"$f":"Laser!F2*VLOOKUP(Laser!B1,WTables!A38:J54,9)/30000","v":6.6666666666666671E-3},{"$f":"Laser!F2*100000/30000","v":6.666666666666667}]
[]
[]
[]
["Sublight (Maneuver) Drives"]
[]
[null,"Type","Thrust/m3"]
[1,{"$f":"VLOOKUP(Missile!B1,A73:G75,2)","v":"LF Rocket"},{"$f":"VLOOKUP(Missile!B1,A73:G75,3)","v":7.5},{"$f":"VLOOKUP(Missile!B1,A73:G75,4)","v":0.3},{"$f":"VLOOKUP(Missile!B1,A73:G75,5)","v":1500},{"$f":"VLOOKUP(Missile!B1,A73:G75,6)","v":7.5},{"$f":"VLOOKUP(Missile!B1,A73:G75,7)","v":"LRF"}]
[2,{"$f":"VLOOKUP(Missile!B1,A76:G78,2)","v":"AZHRAE"},{"$f":"VLOOKUP(Missile!B1,A76:G78,3)","v":9},{"$f":"VLOOKUP(Missile!B1,A76:G78,4)","v":0.5},{"$f":"VLOOKUP(Missile!B1,A76:G78,5)","v":0},{"$f":"VLOOKUP(Missile!B1,A76:G78,6)","v":4.5},{"$f":"VLOOKUP(Missile!B1,A76:G78,7)","v":"HRF"}]
[3,{"$f":"VLOOKUP(Missile!B1,A79:G83,2)","v":"SF Rocket"},{"$f":"VLOOKUP(Missile!B1,A79:G83,3)","v":0},{"$f":"VLOOKUP(Missile!B1,A79:G83,4)","v":0},{"$f":"VLOOKUP(Missile!B1,A79:G83,5)","v":5000},{"$f":"VLOOKUP(Missile!B1,A79:G83,6)","v":5.5},{"$f":"VLOOKUP(Missile!B1,A79:G83,7)","v":"SRF"}]
[4,"Fission Rocket"]
[5,"Fusion Rocket",9,0.35,null,3.5E-4,"LHyd"]
[6,"EAPlaC",null,null,null,0.3,"SFR"]
[7,"HEPlaR"]
[]
[0,"None"]
[5,"LF Rocket",6,0.25,15,7.5,"LRF"]
[6,"LF Rocket",7.5,0.3,1500,7.5,"LRF"]
[0,"None"]
[7,"HF Rocket",7.5,0.3,null,4.5,"HRF"]
[8,"AZHRAE",9,0.5,null,4.5,"HRF"]
[0,"None"]
[5,"SF Rocket",null,null,10,10.5,"SRF"]
[6,"SF Rocket",null,null,1000,9,"SRF"]
[7,"SF Rocket",null,null,2500,7.5,"SRF"]
[8,"SF Rocket",null,null,5000,5.5,"SRF"]
[]
[]
[]
[]
["Launch Canisters",1.1000000000000001,0.1,100]
["Reloadable Launchers",2,0.5,700]
["Autoloaded Launchers",4,0.5,700]
["Uses MFD to guide missiles"]
["Local guidance (laser comm)"]
["Remote station"]
["Manned (guidance, reloading)"]
[]
[]
[]
[]
["Nuclear-Pumped X-Ray Laser Warheads"]
["Tech Level","None","10 kt","20 kt","50 kt","100 kt","200 kt","500 kt","Yield","Price","Damage"]
[0,0,0,0,0,0,0,0,"None",0,0]
[8,0,0.28999999999999998,0.32,0.35,0.39,0.51,0.71,"10 kt",0.6,25]
[9,0,0.19500000000000001,0.215,0.23499999999999999,0.26500000000000001,0.35499999999999998,0.505,"20 kt",0.7,35]
[11,0,0.16,0.18,0.2,0.22,0.28000000000000003,0.38800000000000001,"50 kt",0.8,43]
[13,0,0.13200000000000001,0.14799999999999999,0.16800000000000001,0.188,0.248,0.35799999999999998,"100 kt",0.9,56]
[15,0,0.10299999999999999,0.113,0.127,0.14699999999999999,0.16700000000000001,0.247,"200 kt",1.1000000000000001,66]
[17,0,0.08,0.09,0.1,0.11,0.13,0.17,"500 kt",1.2,79]
[]
[]
[10,10,0]
[50,25,1]
[100,75,2]
[200,150,3]
[400,300,4]
[800,600,5]
[1600,1200,6]
[3200,2400,7]
[6400,4800,8,null,null,null,null," ",null," "]
[12800,9600,9,null,null,null," "," "]
[]
[]
["Type","Vol (m3)","Mass (ton)","Pow (MW)","Area (m2)","Price (MCr)","Crew","Short","Medium","Long","Extreme","Descript","Hits","BR","T4"]
["None",0,0,0,0,0,0]
["M15 Machinegun",2.1510999999999999E-2,1.1745E-2,0,0,9.2300000000000004E-3,0,300,{"$f":"2*H124","v":600},{"$f":"4*H124","v":1200},{"$f":"8*H124","v":2400},"TL-11 15x70mm ETC Machine Gun"]
["15x70mm 100 rds",4.3999999999999999E-5,1.2458E-2,0,0,5.0000000000000001E-4,0]
["M151 Minigun",3.1252500000000003E-2,2.0150000000000001E-2,0,0,1.9113999999999999E-2,0,300,{"$f":"2*H126","v":600},{"$f":"4*H126","v":1200},{"$f":"8*H126","v":2400},"TL-11 15x70mm ETC 3-barrel minigun"]
["30/L70 Rotary Cannon",{"$f":"0.472+0.04","v":0.51200000000000001},{"$f":"0.473+0.04","v":0.51300000000000001},{"$f":"0.02475*20","v":0.495},0,{"$f":"0.174633+0.1","v":0.27463300000000002},0,"510/670","1020/1340","2040/2680","4080/5360","TL-12 30mm/L70 ETCsmoothbore 3 Barrel Rotary Cannon (ROF 20) w/EMS RF, Digital Point Defense Comp., Advanced Stab."]
["30/L70 Autocannon",0.39300000000000002,0.39407500000000001,{"$f":"0.02475*3","v":7.425000000000001E-2},0,0.17304900000000001,0,"510/670","1020/1340","2040/2680","4080/5360","TL-12 30mm/L70 ETCsmoothbore autocannon (ROF 3) w/EMS RF, Digital Ball Comp., Advanced Stab."]
["30mm ammo 10 rds",2.98E-3,6.0196E-3,null,0,0,0,null,null,null,null,null,null," "," "]
["60/L70 Autogun",0.83399999999999996,0.84699999999999998,0.26400000000000001,0,0.180758,0,"520/700 "," 1040/1400 ","2080/2800 "," 4160/5600 ","TL-12 60mm/L70 ETC smoothbore autocannon (ROF 5/turn) w/EMS RF, Digital Ball Comp., Advanced Stab."]
["60mm ammo 10rds",2.1999999999999999E-2,4.4999999999999998E-2,0,0,0,0," "," "," "," "]
["100/L60 Autogun",1.825,1.87,0.36,0,0.19805,0,"490/650 ","980/1300","1960/2600","3920/5200","TL-12 100mm/L60 ETC smoothbore gun (ROF 2/turn) w/EMS RF, Digital Ball Comp., Advanced Stab."]
["100mm ammo 10 rds",0.1492,0.30120000000000002,null,0,0]
[{"$f":"CPRGun!C27","v":"TL-8 120/L50 smoothbore gun"},{"$f":"CPRGun!B16","v":2.0499999999999998},{"$f":"CPRGun!C16","v":2.0500000000000003},{"$f":"CPRGun!F11*CPRGun!J19/5","v":0},0,{"$f":"CPRGun!E16","v":9.7799999999999998E-2},0," "," "," "," "," "," "]
[{"$f":"CPRGun!F20&\" Rounds \"&CPRGun!C28","v":"10 Rounds 120 mm "},{"$f":"CPRGun!B24","v":0.20300000000000001},{"$f":"CPRGun!C24","v":0.40899999999999997},0,0,{"$f":"CPRGun!E24","v":2.1000000000000001E-2},0," "," "," "," "," "," "]
["425 Kj ADA laser",0.44,0.44,0,0,0.17499999999999999,0,260,520,1040,2080,"TL 12 50cm 0.425 Mj air defense laser w/ TL 8 RF and TL  point defense ballistic computer and 50 round mag","LB-2H"]
[]
[]
[]
["LLM-180-1-2",1400,1459.7,5,71,256.65100000000001,1,9,"LL-15H"]
["LTM-64-6-2",42,54,1.778,10,2.3734999999999999,1,11]
[]
["LTM-115-5-2",42,63.85,31.94,10,1.0195000000000001,1,12]
["LTR-121-10-2",42,71.709999999999994,33.61,10,1.5449999999999999,0,12,"LT-1H",{"$f":"\"10:1/9-28\"","v":"10:1/9-28"},{"$f":"\"20:1/5-15\"","v":"20:1/5-15"},{"$f":"\"40:1/2-7\"","v":"40:1/2-7"},{"$f":"\"80:1-4\"","v":"80:1-4"}]
["LTR-144-4-2",42,77.44,40,10,1.048,0,12,"LT-1H",{"$f":"\"4:1/10-30\"","v":"4:1/10-30"},{"$f":"\"8:1/10-30\"","v":"8:1/10-30"},{"$f":"\"16:1/6-20\"","v":"16:1/6-20"},{"$f":"\"32:1/3-10\"","v":"32:1/3-10"}]
["MX-6.4G-6-2",13211,11533,1777.78,64,1167.07,35,12,"MG-116H",{"$f":"\"6:400\"","v":"6:400"},{"$f":"\"12:200\"","v":"12:200"},{"$f":"\"24:100\"","v":"24:100"},{"$f":"\"48:50\"","v":"48:50"}]
["PX-2.5G-10-2",2276.33,2460.6999999999998,69.444000000000003,31.545000000000002,167.19,6,12,"PA-25H"]
["PX-10G-10-2",4152,6211.2,2777.78,16,186.00899999999999,6,12,"PA-62H",{"$f":"\"10:500\"","v":"10:500"},{"$f":"\"20:500\"","v":"20:500"},{"$f":"\"40:500\"","v":"40:500"},{"$f":"\"80:250\"","v":"80:250"}]
["PX-10G-10-2",5787,7412.2,2777.78,32,346.01650000000001,11,12,"PA-74H",{"$f":"\"10:500\"","v":"10:500"},{"$f":"\"20:500\"","v":"20:500"},{"$f":"\"40:500\"","v":"40:500"},{"$f":"\"80:500\"","v":"80:500"}]
["PX-23G-10-2",8912,13662.2,6250,20,377.26650000000001,11,12]
[]
["LTR-135-10-2",41.725000000000001,72.099999999999994,37.5,10,1.5740000000000001,0,13,"LT-1H"]
["MX-40G-4-2",82518,72049.2,11111.1,400,7291.03,216,13,"MG-721H"]
["MX-10G-4-2",14506,13511.2,2777.78,100,1222.97,36,13,"MG-135H"]
["PX-10G-10-2",3829,5661.5,2777.78,30.68,176.91,5,13,"PA-57H"]
[]
["LTM-144-10-5",42,63.887,4,7.5477000000000002E-2,0.90700000000000003,1,14,"LT-1H"]
["LTR-144-10-5",34.887,63.686999999999998,4,7.5477000000000002E-2,0.90500000000000003,0,14,"LT-1H"]
["LTR-144-10-4",42,69.36,160,10,2.04,0,14,"LT-1H",{"$f":"\"10:1/10-30\"","v":"10:1/10-30"},{"$f":"\"10:1/10-30\"","v":"10:1/10-30"},{"$f":"\"10:1/10-30\"","v":"10:1/10-30"},{"$f":"\"10:1/10-30\"","v":"10:1/10-30"},"X-ray Grav, 4 MW"]
["LTR-150-10-4",42,72,166.667,10,2.1,0,14,"LT-1H",{"$f":"\"10:1/10-31\"","v":"10:1/10-31"},{"$f":"\"20:1/8-24\"","v":"20:1/8-24"},{"$f":"\"40:1/4-12\"","v":"40:1/4-12"},{"$f":"\"80:1/2-6\"","v":"80:1/2-6"},"Tunable Grav, 4.167 MW"]
["LTR-324-10-5",42,51.36,108,10,5.8810000000000002,0,14,"LT-1H",{"$f":"\"10:1/14-45\"","v":"10:1/14-45"},{"$f":"\"20:1/9-27\"","v":"20:1/9-27"},{"$f":"\"40:1/4-14\"","v":"40:1/4-14"},{"$f":"\"80:1/2-7\"","v":"80:1/2-7"},"X-ray Non-Grav, 1.35 MW"]
["LBR-324-10-4",84,148.56,360,10,3.84,0,14,"LB-2H",{"$f":"\"10:1/14-45\"","v":"10:1/14-45"},{"$f":"\"20:1/14-45\"","v":"20:1/14-45"},{"$f":"\"40:1/14-45\"","v":"40:1/14-45"},{"$f":"\"80:1/14-45\"","v":"80:1/14-45"},{"$f":"\"X-ray Grav, 9 MW\"","v":"X-ray Grav, 9 MW"}]
["LBR-324-10-4",84,148.56,360,10,3.84,0,14,"LB-2H",{"$f":"\"10:1/14-45\"","v":"10:1/14-45"},{"$f":"\"20:1/11-35\"","v":"20:1/11-35"},{"$f":"\"40:1/6-18\"","v":"40:1/6-18"},{"$f":"\"80:1/3-9\"","v":"80:1/3-9"},"Tunable Grav, 9 MW"]
["LBR-700-10-5",84,104,233.333,10,12.01,0,14,"LB-1H",{"$f":"\"10:1/21-66\"","v":"10:1/21-66"},{"$f":"\"20:1/13-40\"","v":"20:1/13-40"},{"$f":"\"40:1/6-20\"","v":"40:1/6-20"},{"$f":"\"80:1/3-10\"","v":"80:1/3-10"},"X-ray Non-Grav, 2.917 MW"]
["PX-360G-10-2",72620,144456.4,100000,1,780.60400000000004,2,14]
["MX-10G-8-2",22354.799999999999,16014.8,2777.7779999999998,100,2020.58,50,14]
[]
["PX-1G-10-2",376.75,497,27.777999999999999,7.67,21.227,1,15,"PA-5H"]
["PX-2G-10-2",960,1153.1890000000001,55.555999999999997,13.333,63.8,1,15,"PA-12H"]
["LTR-144-10-5",28.260999999999999,53.460999999999999,320,5.2999999999999999E-2,0.56399999999999995,0,15,"LT-1H"]
["LTM-144-10-4",42,59.36,160,10,1.706,1,15,"LT-1H"]

{"sheet":"Laser","index":7,"n_rows":37,"n_cols":11,"rows_kept":37,"cut":false,"hidden":false,"merged":[]}
["Tech Level",12]
["Mount",1,null,null,"Diameter",2,"m",{"$f":"IF(F2>H8,\"Error: \",\"\")&H8&\" m max diameter\"","v":"3.6 m max diameter"}]
["Type",2,null,{"$f":"IF(AND(B3=2,VLOOKUP(B1,WTables!A38:J54,10)=\"N/A\"),\"Error: N/A\",\"\")","v":"Error: N/A"},"Energy",200,"MJ",{"$f":"IF(F3>50*B1,\"Error: \",\"\")&50*B1&\" MJ max pulse\"","v":"600 MJ max pulse"}]
["Focusing",2,null,null,"Rate of fire",6,"shots/30 min"]
["Environ",1,null,null,"Crew",1,null,null,7]
[null,null,null,null,null,null,null,null,{"$f":"I5^2","v":49}]
[null,"Vol (m3)","Mass (ton)","Pow (MW)","Area (m2)","Price (MCr)","Lenght","Width"]
[{"$f":"INDEX(WTables!A2:A7,B2)","v":"turret"},{"$f":"IF(B2=6,\"Unlimited\",INDEX(WTables!B2:B7,B2)*14)","v":42},0,0,{"$f":"INDEX(WTables!E2:E7,B2)","v":10},0,{"$f":"INDEX(WTables!C2:C7,B2)","v":4.2},{"$f":"INDEX(WTables!D2:D7,B2)","v":3.6}]
[]
[null,"Vol (m3)","Mass (ton)","Pow (MW)","Area (m2)","Price (MCr)"]
["Foc Array",{"$f":"ROUND(E11*F3*VLOOKUP(B1,WTables!A38:I54,2)*INDEX(WTables!K2:K7,F4),3)","v":5.0270000000000001},{"$f":"B11","v":5.0270000000000001},0,{"$f":"ROUND(PI()*(F2/2)^2,3)","v":3.1419999999999999},{"$f":"ROUND(IF(B2=6,0.1,0.2)*B11,3)","v":1.0049999999999999},{"$f":"ROUND(VLOOKUP(B4,WTables!A57:D58,B3+1)*INDEX(WTables!F29:F35,B5),1)","v":6.7},{"$f":"\"Hex Eff Range (\"&ROUND(VLOOKUP(B4,WTables!A57:D58,B3+1)*INDEX(WTables!F29:F35,B5)*30000,1)&\" km)\"","v":"Hex Eff Range (200000 km)"}]
["HPG",{"$f":"ROUND(F3*VLOOKUP(B1,WTables!A10:G26,6)/IF(B4=1,0.2,VLOOKUP(B1,WTables!A38:J54,4)),3)","v":18.181999999999999},{"$f":"2*B12","v":36.363999999999997},{"$f":"F3/180/IF(B4=1,0.2,VLOOKUP(B1,WTables!A38:J54,4))","v":2.0202020202020203},0,{"$f":"ROUND(0.01*B12,3)","v":0.182},{"$f":"ROUND(F3*INDEX(WTables!H2:H7,F4)/1800/IF(B4=1,0.2,VLOOKUP(B1,WTables!A38:J54,4)),1)","v":161.6},"MW full ROF"]
["Beam Poi",{"$f":"VLOOKUP(B1,WTables!A10:G26,7)*G13","v":6},{"$f":"B13","v":6},0,0,{"$f":"B13/10","v":0.6},6,"Hex range"]
["LIDAR",{"$f":"VLOOKUP(B1,Tables!R181:U187,3)*E14","v":0},{"$f":"2*B14","v":0},{"$f":"E14","v":0},{"$f":"G14/VLOOKUP(B1,Tables!R181:U187,2)","v":0},{"$f":"5*E14","v":0},0,"Hex range"]
["Workstat",{"$f":"7*G15","v":7},{"$f":"0.2*G15","v":0.2},0,0,{"$f":"VLOOKUP(B1,WTables!A10:I26,9)*G15","v":1.5E-3},{"$f":"IF(F5=1,1,0)","v":1},"Crew"]
[null,{"$f":"SUM(B11:B15)*G16","v":36.209000000000003},{"$f":"SUM(C11:C15)*G16","v":47.591000000000001},{"$f":"SUM(D11:D15)*G16","v":2.0202020202020203},{"$f":"SUM(E11:E15)*G16","v":3.1419999999999999},{"$f":"SUM(F11:F15)*G16","v":1.7885},1,"weapons",{"$f":"IF(F2*G16>G8,\"Error: Max \"&FLOOR(G8/F2,1)&\" weapons\",\"\")","v":""}]
[null,null,null,null,null,null,{"$f":"IF(B16>B8,\"Error: Laser is \"&B16-B8&\" m3 too large\",\"\")","v":""}]
[null,"Short","Medium","Long","Extreme"]
["Range",{"$f":"MAX(G13,G14)","v":6},{"$f":"2*B19","v":12},{"$f":"4*B19","v":24},{"$f":"8*B19","v":48}]
["Damage",{"$f":"ROUND(2.5*SQRT(F3/(MAX(1,ROUND(B19/G11,2)))^2),0)","v":35},{"$f":"ROUND(2.5*SQRT(F3/(MAX(1,ROUND(C19/G11,2)))^2),0)","v":20},{"$f":"ROUND(2.5*SQRT(F3/(MAX(1,ROUND(D19/G11,2)))^2),0)","v":10},{"$f":"ROUND(2.5*SQRT(F3/(MAX(1,ROUND(E19/G11,2)))^2),0)","v":5}]
["Penetrat",{"$f":"ROUND(SQRT(F3/(MAX(1,ROUND(B19/G11,2)))^2)*0.8,0)","v":11},{"$f":"ROUND(SQRT(F3/(MAX(1,ROUND(C19/G11,2)))^2)*0.8,0)","v":6},{"$f":"ROUND(SQRT(F3/(MAX(1,ROUND(D19/G11,2)))^2)*0.8,0)","v":3},{"$f":"ROUND(SQRT(F3/(MAX(1,ROUND(E19/G11,2)))^2)*0.8,0)","v":2}]
[]
[{"$f":"\"TL-\"&B1&\" \"&F3&\"-MJ \"&CHOOSE(B2,\"Laser Turret\",\"Laser Barbette\",\"Small Laser Bay\",\"Large Laser Bay\",\"Custom Laser Bay\",\"Spinal Laser\")&\" (Loc:0-Arcs:0;\"&G12&\" MW;\"&IF(G27=0,\"No\",G27)&\" crew)\"","v":"TL-12 200-MJ Laser Turret (Loc:0-Arcs:0;161.6 MW;1 crew)"}]
[{"$f":"\"L\"&INDEX(WTables!L2:L7,B2)&INDEX(WTables!F6:F7,F5)&\"-\"&IF(F3>=1000,ROUND(F3/1000,0)&\"G\",F3)&\"-\"&MAX(G13,G14)&\"-\"&INDEX(WTables!I2:I7,F4)&\": \"&INDEX(WTables!G4:G5,B3)&\" \"&INDEX(WTables!G6:G7,B4)&\" \"&INDEX(WTables!F4:F5,F5)&\" \"&INDEX(WTables!A2:A7,B2)&\" laser.\"&\" Can be overpowered to -\"&INDEX(WTables!I2:I7,F4)&\" Diff Mods with \"&G12&\" MW power input.\"","v":"LTM-200-6-5: x-ray non-gravitic manned turret laser. Can be overpowered to -5 Diff Mods with 161.6 MW power input."}]
[]
[null,"Vol (m3)","Mass (ton)","Pow (MW)","Area (m2)","Price (MCr)","Crew","Short","Medium","Long","Extreme"]
["BL",{"$f":"IF(B2=6,B16,B8)","v":42},{"$f":"C16","v":47.591000000000001},{"$f":"G12","v":161.6},{"$f":"IF(B2=6,E16,E8)","v":10},{"$f":"F16","v":1.7885},{"$f":"G15","v":1},{"$f":"B19&\":1/\"&B21&\"-\"&B20","v":"6:1/11-35"},{"$f":"C19&\":1/\"&C21&\"-\"&C20","v":"12:1/6-20"},{"$f":"D19&\":1/\"&D21&\"-\"&D20","v":"24:1/3-10"},{"$f":"E19&\":1/\"&E21&\"-\"&E20","v":"48:1/2-5"}]
["BR",{"$f":"\"L(\"&IF(G16>1,\"x\"&G16,\"\")&IF(INDEX(WTables!I2:I7,F4)>0,\"-\"&INDEX(WTables!I2:I7,F4),\"\")&\")\"&MAX(G13,G14)&\":\"&BattleRider(B20)&\"-\"&BattleRider(C20)&\"-\"&BattleRider(D20)&\"-\"&BattleRider(E20)","v":{"$error":"#NAME?"}}]
["T4",{"$f":"BattleRider(ROUND(G16*2.5*SQRT(F3/(MAX(1,ROUND(10/G11,2)))^2),0))&\"-\"&BattleRider(ROUND(G16*2.5*SQRT(F3/(MAX(1,ROUND(20/G11,2)))^2),0))&\"-\"&BattleRider(ROUND(G16*2.5*SQRT(F3/(MAX(1,ROUND(40/G11,2)))^2),0))&\"-\"&BattleRider(ROUND(G16*2.5*SQRT(F3/(MAX(1,ROUND(80/G11,2)))^2),0))","v":{"$error":"#NAME?"}}]
["(W)USP",{"$f":"\"(+\"&IF(G16>1,VLOOKUP( (INDEX(WTables!A110:A119,F4) * G16),WTables!B110:C119,2),VLOOKUP( (INDEX(WTables!A110:A119,F4) * G16),WTables!A110:C119,3))&\") \"&ROUND(0.375*B35^0.333,0)&\"/\"&B37&\"-\"&C37&\"-\"&D37&\"-\"&E37","v":"(+5) 1/35-27-17-11"}]
["Hit Capab",{"$f":"\"L\"&INDEX(WTables!L2:L7,B2)&\"-\"&IF(G16>1,G16&\"x\",\"\")&Hits(C16/G16)","v":{"$error":"#NAME?"}}]
[]
[]
["Range",5,10,20,40]
["Damage",{"$f":"ROUND(2.5*SQRT(F3/(MAX(1,ROUND(5/G11,2)))^2),0)","v":35},{"$f":"ROUND(2.5*SQRT(F3/(MAX(1,ROUND(10/G11,2)))^2),0)","v":24},{"$f":"ROUND(2.5*SQRT(F3/(MAX(1,ROUND(20/G11,2)))^2),0)","v":12},{"$f":"ROUND(2.5*SQRT(F3/(MAX(1,ROUND(40/G11,2)))^2),0)","v":6}]
["Peneterat",{"$f":"ROUND(SQRT(F3/(MAX(1,ROUND(5/G11,2)))^2)*0.8,0)","v":11},{"$f":"ROUND(SQRT(F3/(MAX(1,ROUND(10/G11,2)))^2)*0.8,0)","v":8},{"$f":"ROUND(SQRT(F3/(MAX(1,ROUND(20/G11,2)))^2)*0.8,0)","v":4},{"$f":"ROUND(SQRT(F3/(MAX(1,ROUND(40/G11,2)))^2)*0.8,0)","v":2}]
[null,{"$f":"ROUND(6*(0.5*B35*B36)^0.333,0)","v":35},{"$f":"ROUND(6*(0.5*C35*C36)^0.333,0)","v":27},{"$f":"ROUND(6*(0.5*D35*D36)^0.333,0)","v":17},{"$f":"ROUND(6*(0.5*E35*E36)^0.333,0)","v":11}]

{"sheet":"PAWS","index":8,"n_rows":28,"n_cols":11,"rows_kept":28,"cut":false,"hidden":false,"merged":[]}
["Tech Level",14,null,null,"Lenght",60,"m",{"$f":"IF(F1>G8,\"Error: \",\"\")&G8&\" m max lenght\"","v":"Unlimited m max lenght"}]
["Mount",6,null,null,"Diameter",3.5682999999999998,"m",{"$f":"IF(F2>F1/8,\"Error: \",\"\")&F1/8&\" m max diamater\"","v":"7.5 m max diamater"}]
["Type",2,null,null,"Energy",3600,"MJ",{"$f":"IF(F3>F1^2,\"Error: \",\"\")&F1^2&\" MJ max pulse\"","v":"3600 MJ max pulse"}]
["Environ",1,null,null,"Rate of fire",3,"shots/30 min"]
[]
[]
[null,"Vol (m3)","Mass (ton)","Pow (MW)","Area (m2)","Price (MCr)","Lenght","Width"]
[{"$f":"INDEX(WTables!A2:A7,B2)","v":"spinal"},{"$f":"IF(B2=6,\"Unlimited\",INDEX(WTables!B2:B7,B2)*14)","v":"Unlimited"},0,0,{"$f":"INDEX(WTables!E2:E7,B2)","v":"Unlimited"},0,{"$f":"INDEX(WTables!C2:C7,B2)","v":"Unlimited"},{"$f":"INDEX(WTables!D2:D7,B2)","v":"Unlimited"}]
[]
[null,"Vol (m3)","Mass (ton)","Pow (MW)","Area (m2)","Price (MCr)",null,null,null,{"$f":"2*SQRT(6/PI())","v":2.763953195770684}]
["Tunnel",{"$f":"ROUND(F1*E11*INDEX(WTables!J2:J7,F4),3)","v":600},{"$f":"B11*VLOOKUP(B1,WTables!A10:E26,5)","v":450},0,{"$f":"ROUND(PI()*(F2/2)^2,3)","v":10},{"$f":"B11*INDEX(WTables!F2:F3,B3)","v":60},{"$f":"ROUND(F1*VLOOKUP(B1,WTables!A10:E26,2) * E11*VLOOKUP(B1,WTables!A10:E26,B3+2) * 1000*VLOOKUP(B4,WTables!A29:D35,2+B3)/30000,1)","v":40},"Hex Eff Range"]
["HPG",{"$f":"ROUND(VLOOKUP(B1,WTables!A10:G26,6)*5*F3,3)","v":720},{"$f":"2*B12","v":1440},{"$f":"ROUND(5*F3/180,3)","v":100},0,{"$f":"ROUND(0.01*B12,3)","v":7.2},{"$f":"ROUND(INDEX(WTables!H2:H7,F4)*5*F3/1800,3)","v":1000},"MW full ROF"]
["Beam Poi",{"$f":"VLOOKUP(B1,WTables!A10:G26,7)*G13","v":6},{"$f":"B13","v":6},0,0,{"$f":"B13/10","v":0.6},10,"Hex range"]
["Workstat",{"$f":"7*G14","v":14},{"$f":"0.2*G14","v":0.4},0,0,{"$f":"VLOOKUP(B1,WTables!A10:I26,9)*G14","v":4.0000000000000001E-3},{"$f":"MAX(1,ROUND((B11/100)*VLOOKUP(B1,WTables!A10:H26,8),0))","v":2},"crew"]
[null,{"$f":"SUM(B11:B14)*G15","v":1340},{"$f":"SUM(C11:C14)*G15","v":1896.4},{"$f":"SUM(D11:D14)*G15","v":100},{"$f":"SUM(E11:E14)*G15","v":10},{"$f":"SUM(F11:F14)*G15","v":67.804000000000002},1,"weapons",{"$f":"IF(B2=6,\"\",IF(G15>H8/F2,\"Error: Max \"&FLOOR(H8/F2,1)&\" weapons in \"&INDEX(WTables!A2:A7,PAWS!B2),\"\"))","v":""}]
[null,{"$f":"ROUND(B15/14,3)","v":95.713999999999999},"tons"]
[null,"Short","Medium","Long","Extreme"]
["Range",{"$f":"G13","v":10},{"$f":"2*G13","v":20},{"$f":"4*G13","v":40},{"$f":"8*G13","v":80}]
["Damage",{"$f":"MIN(5*SQRT(F3),ROUND(5*SQRT(F3*1/ROUND(B18/G11,2)^2),0))","v":300},{"$f":"MIN(5*SQRT(F3),ROUND(5*SQRT(F3*1/ROUND(C18/G11,2)^2),0))","v":300},{"$f":"MIN(5*SQRT(F3),ROUND(5*SQRT(F3*1/ROUND(D18/G11,2)^2),0))","v":300},{"$f":"MIN(5*SQRT(F3),ROUND(5*SQRT(F3*1/ROUND(E18/G11,2)^2),0))","v":150}]
[]
[{"$f":"\"TL-\"&B1&\" \"&IF(F3>=1000,ROUND(F3/1000,1)&\" GJ\",F3&\" MJ\")&\" Particle Accelerator (Loc:0-Arcs:0;\"&G12&\" MW;\"&G14&\" crew)\"","v":"TL-14 3.6 GJ Particle Accelerator (Loc:0-Arcs:0;1000 MW;2 crew)"}]
[{"$f":"\"P\"&INDEX(WTables!L2:L7,B2)&\"-\"&IF(F3>=1000,ROUND(F3/1000,0)&\"G\",F3)&\"-\"&G13&\"-\"&INDEX(WTables!I2:I7,F4)&\": \"&INDEX(WTables!G2:G3,B3)&\" \"&INDEX(WTables!A2:A7,B2)&\" particle beam.\"&\" Can be overpowered to -\"&INDEX(WTables!I2:I7,F4)&\" Diff Mods with \"&G12&\" MW power input.\"","v":"PX-4G-10-2: N-PAW spinal particle beam. Can be overpowered to -2 Diff Mods with 1000 MW power input."}]
[]
[null,"Vol (m3)","Mass (ton)","Pow (MW)","Area (m2)","Price (MCr)","Crew","Short","Medium","Long","Extreme"]
["BL",{"$f":"IF(B2=6,B15,INDEX(WTables!B2:B7,B2)*14)","v":1340},{"$f":"C15","v":1896.4},{"$f":"D15","v":100},{"$f":"E15","v":10},{"$f":"F15","v":67.804000000000002},{"$f":"G14","v":2},{"$f":"B18&\":\"&B19","v":"10:300"},{"$f":"C18&\":\"&C19","v":"20:300"},{"$f":"D18&\":\"&D19","v":"40:300"},{"$f":"E18&\":\"&E19","v":"80:150"}]
["BR",{"$f":"\"P(\"&IF(G15>1,\"x\"&G15,\"\")&IF(INDEX(WTables!I2:I7,F4)>0,\"-\"&INDEX(WTables!I2:I7,F4),\"\")&\")\"&G13&\":\"&BattleRider(B19)&\"-\"&BattleRider(C19)&\"-\"&BattleRider(D19)&\"-\"&BattleRider(E19)","v":{"$error":"#NAME?"}}]
["T4",{"$f":"BattleRider(MIN(G15*5*SQRT(F3),ROUND(G15*5*SQRT(F3*1/ROUND(10/G11,2)^2),0)))&\"-\"&BattleRider(MIN(G15*5*SQRT(F3),ROUND(G15*5*SQRT(F3*1/ROUND(20/G11,2)^2),0)))&\"-\"&BattleRider(MIN(G15*5*SQRT(F3),ROUND(G15*5*SQRT(F3*1/ROUND(40/G11,2)^2),0)))&\"-\"&BattleRider(MIN(G15*5*SQRT(F3),ROUND(G15*5*SQRT(F3*1/ROUND(80/G11,2)^2),0)))","v":{"$error":"#NAME?"}}]
["Hit Capab",{"$f":"\"PA-\"&IF(G15>1,G15&\"x\",\"\")&Hits(C15/G15)","v":{"$error":"#NAME?"}}]

{"sheet":"Meson","index":9,"n_rows":28,"n_cols":11,"rows_kept":28,"cut":false,"hidden":false,"merged":[]}
["Tech Level",14,null,null,"Lenght",250,"m",{"$f":"IF(F1>G8,\"Error: \",\"\")&G8&\" m max lenght\"","v":"Unlimited m max lenght"}]
["Mount",6,null,null,"Diameter",{"$f":"ROUND(2*SQRT(E11/PI()),1)","v":5.6},"m"]
[null,null,null,null,"Energy",2500,"MJ"]
[null,null,null,null,"Rate of fire",3,"shots/30 min"]
[]
[]
[null,"Vol (m3)","Mass (ton)","Pow (MW)","Area (m2)","Price (MCr)","Lenght","Width"]
[{"$f":"INDEX(WTables!A2:A7,B2)","v":"spinal"},{"$f":"IF(B2=6,\"Unlimited\",INDEX(WTables!B2:B7,B2)*14)","v":"Unlimited"},0,0,{"$f":"INDEX(WTables!E2:E7,B2)","v":"Unlimited"},0,{"$f":"INDEX(WTables!C2:C7,B2)","v":"Unlimited"},{"$f":"INDEX(WTables!D2:D7,B2)","v":"Unlimited"}]
[]
[null,"Vol (m3)","Mass (ton)","Pow (MW)","Area (m2)","Price (MCr)"]
["Tunnel",{"$f":"F1*F3*VLOOKUP(B1,WTables!A10:L26,11)","v":6250},{"$f":"B11*VLOOKUP(B1,WTables!A10:L26,12)","v":3750},0,{"$f":"B11/F1","v":25},{"$f":"B11*0.1","v":625},{"$f":"F1*VLOOKUP(B1,WTables!A10:L26,10)*1000/30000","v":10},"Hex Eff Range"]
["HPG",{"$f":"ROUND(VLOOKUP(B1,WTables!A10:G26,6)*5*F3,3)","v":500},{"$f":"2*B12","v":1000},{"$f":"ROUND(5*F3/180,3)","v":69.444000000000003},0,{"$f":"ROUND(0.01*B12,3)","v":5},{"$f":"ROUND(INDEX(WTables!H2:H7,F4)*5*F3/1800,3)","v":694.44399999999996},"MW full ROF"]
["Beam Poi",{"$f":"VLOOKUP(B1,WTables!A10:G26,7)*G13","v":3.5999999999999996},{"$f":"B13","v":3.5999999999999996},0,0,{"$f":"B13/10","v":0.36},6,"Hex range"]
["Workstat",{"$f":"7*G14","v":112},{"$f":"0.2*G14","v":3.2},0,0,{"$f":"VLOOKUP(B1,WTables!A10:I26,9)*G14","v":3.2000000000000001E-2},{"$f":"MAX(1,ROUND((B11/100)*VLOOKUP(B1,WTables!A10:H26,8),0))","v":16},"crew"]
[null,{"$f":"SUM(B11:B14)*G15","v":6865.6},{"$f":"SUM(C11:C14)*G15","v":4756.8},{"$f":"SUM(D11:D14)*G15","v":69.444000000000003},{"$f":"SUM(E11:E14)*G15","v":25},{"$f":"SUM(F11:F14)*G15","v":630.39200000000005},1,"weapons",{"$f":"IF(B2=6,\"\",IF(G15>H8/F2,\"Error: Max \"&FLOOR(H8/F2,1)&\" weapons in \"&INDEX(WTables!A2:A7,PAWS!B2),\"\"))","v":""}]
[]
[null,"Short","Medium","Long","Extreme"]
["Range",{"$f":"G13","v":6},{"$f":"2*G13","v":12},{"$f":"4*G13","v":24},{"$f":"8*G13","v":48},null,{"$f":"VLOOKUP(B1,WTables!A10:L26,10)*F1*8.5/30","v":85},"Hex maximum range"]
["Damage",{"$f":"ROUND(5*SQRT(F3/MAX(1,ROUND((B18/G11)^2/5,1)*5)),0)","v":250},{"$f":"ROUND(5*SQRT(F3/MAX(1,ROUND((C18/G11)^2/5,1)*5)),0)","v":204},{"$f":"ROUND(5*SQRT(F3/MAX(1,ROUND((D18/G11)^2/5,1)*5)),0)","v":102},{"$f":"ROUND(5*SQRT(F3/MAX(1,ROUND((E18/G11)^2/5,1)*5)),0)","v":52}]
[]
[{"$f":"\"TL-\"&B1&\" \"&IF(F3>=1000,ROUND(F3/1000,1)&\" GJ\",F3&\" MJ\")&\" Meson Gun (Loc:0-Arcs:0;\"&G12&\" MW;\"&G14&\" crew)\"","v":"TL-14 2.5 GJ Meson Gun (Loc:0-Arcs:0;694.444 MW;16 crew)"}]
[{"$f":"\"M\"&INDEX(WTables!L2:L7,B2)&\"-\"&IF(F3>=1000,ROUND(F3/1000,0)&\"G\",F3)&\"-\"&G13&\"-\"&INDEX(WTables!I2:I7,F4)&\": \"&INDEX(WTables!A2:A7,B2)&\" meson gun.\"&\" Can be overpowered to -\"&INDEX(WTables!I2:I7,F4)&\" Diff Mods with \"&G12&\" MW power input.\"","v":"MX-3G-6-2: spinal meson gun. Can be overpowered to -2 Diff Mods with 694.444 MW power input."}]
[]
[null,"Vol (m3)","Mass (ton)","Pow (MW)","Area (m2)","Price (MCr)","Crew","Short","Medium","Long","Extreme"]
["BL",{"$f":"IF(B2=6,B15,INDEX(WTables!B2:B7,B2)*14)","v":6865.6},{"$f":"C15","v":4756.8},{"$f":"G12","v":694.44399999999996},{"$f":"E15","v":25},{"$f":"F15","v":630.39200000000005},{"$f":"G14","v":16},{"$f":"B18&\":\"&B19","v":"6:250"},{"$f":"IF(G18<C18,\"X\",C18&\":\"&C19)","v":"12:204"},{"$f":"IF(G18<D18,\"X\",D18&\":\"&D19)","v":"24:102"},{"$f":"IF(G18<E18,\"X\",E18&\":\"&E19)","v":"48:52"}]
["BR",{"$f":"\"P(\"&IF(G15>1,\"x\"&G15,\"\")&IF(INDEX(WTables!I2:I7,F4)>0,\"-\"&INDEX(WTables!I2:I7,F4),\"\")&\")\"&G13&\":\"&BattleRider(B19)&\"-\"&BattleRider(C19)&\"-\"&IF(G18<D18,\"X\",BattleRider(D19))&\"-\"&IF(G18<E18,\"X\",BattleRider(E19))","v":{"$error":"#NAME?"}}]
["T4",{"$f":"BattleRider(MIN(G15*5*SQRT(F3),ROUND(G15*5*SQRT(F3*1/ROUND(10/G11,2)^2),0)))&\"-\"&IF(G18<20,\"X\",BattleRider(MIN(G15*5*SQRT(F3),ROUND(G15*5*SQRT(F3*1/ROUND(20/G11,2)^2),0))))&\"-\"&IF(G18<40,\"X\",BattleRider(MIN(G15*5*SQRT(F3),ROUND(G15*5*SQRT(F3*1/ROUND(40/G11,2)^2),0))))&\"-\"&IF(G18<80,\"X\",BattleRider(MIN(G15*5*SQRT(F3),ROUND(G15*5*SQRT(F3*1/ROUND(80/G11,2)^2),0))))","v":{"$error":"#NAME?"}}]
["Hit Capab",{"$f":"\"MG-\"&IF(G15>1,G15&\"x\",\"\")&Hits(C15/G15)","v":{"$error":"#NAME?"}}]

{"sheet":"Missile","index":10,"n_rows":50,"n_cols":9,"rows_kept":50,"cut":false,"hidden":false,"merged":[]}
["Tech Level",14]
["Mount",1]
[]
[null,"Vol (m3)","Mass (ton)","Pow (MW)","Area (m2)","Price (MCr)"]
["X-ray nuke",{"$f":"VLOOKUP(B1,WTables!A101:H107,G5+1)","v":0},{"$f":"B5","v":0},null,null,{"$f":"INDEX(WTables!J101:J107,G5)","v":0},1]
["AHEAD",{"$f":"C6/5-0.0532","v":6.2E-2},0.57599999999999996,null,null,{"$f":"C6*0.05","v":2.8799999999999999E-2}]
["Las Comm",{"$f":"VLOOKUP(B1,Tables!A116:I123,H7+1)","v":2.8000000000000001E-2},{"$f":"2*B7","v":5.6000000000000001E-2},{"$f":"INDEX(Tables!B125:I125,H7)","v":0.15},{"$f":"IF(H7=1,0,1)","v":1},{"$f":"INDEX(Tables!B124:I124,H7)","v":5.6000000000000001E-2},null,7,"hex range"]
["LIDAR",{"$f":"VLOOKUP(B1,Tables!R181:U187,3)*E8","v":0},{"$f":"2*B8","v":0},{"$f":"E8","v":0},{"$f":"H8/VLOOKUP(B1,Tables!R181:U187,2)","v":0},{"$f":"5*E8","v":0},null,0,"hex range"]
["HEPlaR",0.2,{"$f":"B9","v":0.2},{"$f":"10*B9","v":2},{"$f":"B9","v":0.2},{"$f":"0.01*B9","v":2E-3},null,{"$f":"2000*B9","v":400},"kN thrust"]
["Fuel",{"$f":"0.00125*H9*H10","v":0.25},{"$f":"0.07*B10","v":1.7500000000000002E-2},null,null,null,null,0.5,"h"]
["Battery",{"$f":"(H10*D9+D7+D8)/VLOOKUP(B1,Tables!V242:Y260,2)","v":0.45999999999999996},{"$f":"B11*VLOOKUP(B1,Tables!V242:Y260,3)","v":1.1499999999999999},null,null,{"$f":"B11*VLOOKUP(B1,Tables!V242:Y260,4)","v":4.5999999999999999E-3},null,{"$f":"FLOOR(H9/(10*C12),0.01)","v":20},"G thrust"]
[null,{"$f":"MAX(0,SUM(B5:B11))","v":1},{"$f":"MAX(1,ROUND(ROUND(SUM(C5:C11),3),3))","v":2},0,0,{"$f":"SUM(F5:F11)","v":9.1400000000000009E-2},null,{"$f":"FLOOR(2*H10*H9/(10*C12),0.01)","v":20},"G-turns"]
[]
[null,"Vol (m3)","Mass (ton)","Pow (MW)","Area (m2)","Price (MCr)","Lenght","Width"]
[{"$f":"INDEX(WTables!A2:A7,B2)","v":"turret"},{"$f":"IF(B2=6,\"Unlimited\",INDEX(WTables!B2:B7,B2)*14)","v":42},0,0,{"$f":"INDEX(WTables!E2:E7,B2)","v":10},0,{"$f":"INDEX(WTables!C2:C7,B2)","v":4.2},{"$f":"INDEX(WTables!D2:D7,B2)","v":3.6}]
[]
[null,"Vol (m3)","Mass (ton)","Pow (MW)","Area (m2)","Price (MCr)"]
["Launcher",{"$f":"B12*INDEX(WTables!B88:B90,H18)*G18","v":12},{"$f":"B18*INDEX(WTables!C88:C90,H18)","v":6},null,null,{"$f":"B18*INDEX(WTables!D88:D90,H18)/1000000","v":8.3999999999999995E-3},3,3]
["Magazine",{"$f":"1.5*MAX(0,G19-G18)*B12","v":28.5},{"$f":"C12*G19","v":44},null,null,0,22,{"$f":"\"Missiles (\"&CHOOSE(H18,\"Canisters can be replaced in port/service dock)\",\"1-hour reaload time with 1 crew)\",ROUND(C12,0)&\"-min reload time)\")","v":"Missiles (2-min reload time)"}]
["Cargo",{"$f":"1.05*B12*G20","v":0},{"$f":"C12*G20","v":0},null,null,0,0,{"$f":"\"Missiles (2-hour reload time with \"&ROUND(C12/2,0)&\" crew)\"","v":"Missiles (2-hour reload time with 1 crew)"}]
["Commun",{"$f":"IF(H21=1,0,VLOOKUP(B1,Tables!A116:I123,8))","v":2.8000000000000001E-2},{"$f":"IF(H21=1,0,2*B21)","v":5.6000000000000001E-2},{"$f":"IF(H21=1,0,0.15)","v":0.15},{"$f":"IF(H21=1,0,1)","v":1},{"$f":"IF(H21=1,0,0.15)","v":0.15},null,2]
["Workstat",{"$f":"IF(H22=1,0,7)","v":0},{"$f":"IF(H22=1,0,0.2)","v":0},null,null,{"$f":"IF(H22=1,0,VLOOKUP(B1,Tables!A73:E83,5))","v":0},null,1]
[null,{"$f":"SUM(B18:B22)","v":40.527999999999999},{"$f":"SUM(C18:C22)","v":50.055999999999997},{"$f":"SUM(D18:D22)","v":0.15},{"$f":"SUM(E18:E22)","v":1},{"$f":"SUM(F18:F22)","v":0.15839999999999999},{"$f":"IF(B15-B23<0,\"Error: Launcher is \"&B23-B15&\" m3 larger than mount\",\"\")","v":""}]
[]
[{"$f":"\"TL-\"&B1&CHOOSE(B2,\" MissileTurret\",\" Missile Barbette\",\" Small Missile Bay\",\" Large Missile Bay\",\" Custom Missile Bay\",\" Spinal Missile Bay\")&\" (Loc:0-Arcs:0;\"&D27&\" MW;\"&IF(G27=0,\"No\",G27)&\" crew)\"","v":"TL-14 MissileTurret (Loc:0-Arcs:0;0.15 MW;No crew)"}]
[null,"Vol (m3)","Mass (ton)","Pow (MW)","Area (m2)","Price (MCr)","Crew"]
["BL",{"$f":"IF(B2=6,ROUND(B23,3),B15)","v":42},{"$f":"C23","v":50.055999999999997},{"$f":"D23","v":0.15},{"$f":"IF(B2=6,E23,E15)","v":10},{"$f":"F23","v":0.15839999999999999},{"$f":"IF(H22=1,0,1)","v":0}]
[{"$f":"\"M\"&INDEX(WTables!L2:L7,B2)&\"-\"&Hits(C23)","v":{"$error":"#NAME?"}}]
[]
[{"$f":"IF(H7=1,IF(H8=0,\"Unguided \",\"Homing \"),\"Laser guided \")&A40&\" kg AHEAD warhead, with \"&ROUND(A39/1000000,1)&\" million \"&ROUND(A44,1)&\" mm projectiles\"","v":"Laser guided 576 kg AHEAD warhead, with 76.6 million 1 mm projectiles"}]
[]
[{"$f":"MIN(H11,H12)","v":20},"hex/turn terminal"]
[6,"G target acceleration"]
[0.5,"hex range"]
[{"$f":"1800*A34/A32","v":45},"sec to impact"]
[{"$f":"PI()*(5*A33*A35^2)^2","v":11594244037.613981},"m2 target area"]
[100,"ton target displacement"]
[{"$f":"PI()*(14*A37/(4/3*PI()))^(2/3)","v":151.30135715546729},"m2 ship profile"]
[{"$f":"A36/A38","v":76630139.052226096},"projectiles"]
[{"$f":"1000*C6","v":576},"kg total mass"]
[{"$f":"A40/A39","v":7.5166247526633879E-6},"kg projectile mass"]
[15,"kg/dm3 projectile density"]
[{"$f":"A41/A42","v":5.0110831684422582E-7},"dm3 projectile volume"]
[{"$f":"200*(A43/(4/3*PI()))^(1/3)","v":0.98547209122151891},"mm projectile diameter"]
[{"$f":"30000*A32/1800","v":333.33333333333331},"km/s velocity"]
[{"$f":"0.5*A41*(1000*A45)^2","v":417590.26403685485},"J projectile energy"]
[{"$f":"ROUND(SQRT(A46)/15,0)","v":43},"DV"]
[{"$f":"A44*(1.5+0.51*A45)*(1-EXP(-1.6*(1000*A45)))","v":169.00846364449049},"mm crater diameter"]
[{"$f":"A44*(2.1+0.58*A45)","v":192.59409569439217},"mm crater depth"]
[{"$f":"ROUND(A47/(A49/5),0)","v":1},"Pen"]

{"sheet":"Sheet1","index":11,"n_rows":0,"n_cols":0,"rows_kept":0,"cut":false,"hidden":false,"merged":[]}

{"sheet":"sheet 2","index":12,"n_rows":171,"n_cols":15,"rows_kept":171,"cut":false,"hidden":false,"merged":[]}
["Name","Displac","Lenght (m)","Width (m)","Area (m2)","Price","Type","ROF","Diff Mod","Vol Mod","FA Mult"]
["turret",3,4.2,3.6,10,0.09,"C-PAW",10,0,1,1,"T"]
["barbette",6,5.25,4.5,16,0.1,"N-PAW",50,1,1,1,"B"]
["small bay",50,{"$f":"ROUND(1.4*(B4*14)^(1/3),0)","v":12},{"$f":"5*ROUND(SQRT(B4*14/C4)/5,1)","v":7.5},{"$f":"C4*D4","v":90},"manned","tunable",100,2,1,1,"S"]
["large bay",100,{"$f":"ROUND(1.4*(B5*14)^(1/3),0)","v":16},{"$f":"5*ROUND(SQRT(B5*14/C5)/5,1)","v":9.5},{"$f":"C5*D5","v":152},"remote","x-ray",200,3,1.3,2,"L"]
["custom bay",200,{"$f":"ROUND(1.4*(B6*14)^(1/3),0)","v":20},{"$f":"5*ROUND(SQRT(B6*14/C6)/5,1)","v":12},{"$f":"C6*D6","v":240},"M","gravitic focus",400,4,1.7,4,"C"]
["spinal","Unlimited","Unlimited","Unlimited","Unlimited","R","non-gravitic",800,5,2.2000000000000002,8,"X"]
[]
["Tech Level","Len Mult","C-PAW","N-PAW","Mass Mult","HPG","Beam Poi","Contr Mult","Workstat","Len Mult","Vol Mult","Mass Mult"]
[8,0.12,1,0,1.2,0.125,3,0.6,7.5000000000000002E-4,"N/A","N/A","N/A"]
[9,0.14000000000000001,1,1,1,0.1,1.5,0.5,1E-3,"N/A","N/A","N/A"]
[10,0.16,2,1,1,0.08,1.5,0.45,1.5E-3,"N/A","N/A","N/A"]
[11,0.2,3,2,0.75,0.06,1.5,0.4,1.5E-3,0.8,0.02,1]
[12,0.25,3,3,0.75,0.05,1,0.35,1.5E-3,1,0.01,0.75]
[13,0.3,4,3,0.75,4.4999999999999998E-2,1,0.3,2E-3,1,0.01,0.75]
[14,0.5,4,4,0.75,0.04,0.6,0.25,2E-3,1.2,0.01,0.6]
[15,1,5,4,0.75,3.5000000000000003E-2,0.3,0.2,2E-3,1.2,0.01,0.6]
[16,1.25,5,5,0.6,0.03,0.3,0.15,2E-3,1.4,5.0000000000000001E-3,0.5]
[17,1.3,5,5,0.5,2.5000000000000001E-2,0.15,0.13,2.5000000000000001E-3,1.4,5.0000000000000001E-3,0.5]
[18,1.4,6,5,0.4,0.02,0.15,0.11,2.5000000000000001E-3,1.5,5.0000000000000001E-3,0.4]
[19,1.5,6,6,0.4,1.4999999999999999E-2,0.08,0.09,2.5000000000000001E-3,1.5,5.0000000000000001E-3,0.4]
[20,1.6,6,6,0.3,0.01,null,7.0000000000000007E-2,2.5000000000000001E-3,1.6,2E-3,0.3]
[21,1.7,6,6,0.3,5.0000000000000001E-3,null,0.05,3.0000000000000001E-3,1.6,2E-3,0.3]
[22,1.8,7,6,0.2,null,null,null,3.0000000000000001E-3,1.8,2E-3,0.2]
[23,1.9,7,7,0.2,null,null,null,3.0000000000000001E-3,1.8,2E-3,0.2]
[24,2,7,7,0.1,null,null,null,3.0000000000000001E-3,2,1E-3,0.1]
[]
[null,"Atmosph","C-PAW","N-PAW","VL-IR Las","UV-GR Las"]
[1,"Vacuum",1E-3,1,1,1]
[2,"Trace",5.0000000000000001E-3,1,1,0.9]
[3,"Very Thin",0.01,0.1,0.5,0.1]
[4,"Thin",0.05,0.02,0.2,0.02]
[5,"Standard",0.1,0.01,0.1,0.01]
[6,"Dense",0.1,5.0000000000000001E-3,0.05,5.0000000000000001E-3]
[7,"Exotic",0.05,1E-3,0.01,1E-3]
[]
[null,"HFA Vol","LFA Vol","Efficiency","Hvy Mult","Hvy Pow","Lt Mult","Lt Pow","RF","XR Mult"]
[7,1,10,0.2,1,1,1,1,3,"N/A"]
[8,1,10,0.25,1,1,1,1,20,"N/A"]
[9,0.1,1,0.3,1,2,1,1,33,"N/A"]
[10,0.01,1,0.35,3,2,1,2,50,"N/A"]
[11,0.01,1,0.45,4,2,3,2,100,"N/A"]
[12,1E-3,0.5,0.55000000000000004,5,2,4,2,100,"N/A"]
[13,1E-3,0.5,0.65,6,2,5,2,100,4]
[14,1E-3,0.5,0.75,6,2,6,2,100,5]
[15,1E-3,0.5,0.85,6,2,6,2,1000,6]
[16,5.0000000000000001E-4,0.1,0.95,6,2,6,2,2000,6]
[17,5.0000000000000001E-4,0.1,0.95,6,2,6,2,5000,6]
[18,5.0000000000000001E-4,0.1,0.95,6,2,6,2,10000,6]
[19,5.0000000000000001E-4,0.1,0.95,6,2,6,2,50000,6]
[20,1E-4,0.05,0.95,6,2,6,2,100000,"N/A"]
[21,1E-4,0.05,0.95,6,2,6,2,200000,"N/A"]
[22,1E-4,0.05,0.95,6,2,6,2,500000,"N/A"]
[23,1E-4,0.05,0.95,6,2,6,2,1000000,"N/A"]
[]
[null,"Tunable","X-ray"]
[1,{"$f":"((VLOOKUP(Laser!B1,'sheet 2'!A38:I54,5)*(Laser!F2*10))^VLOOKUP(Laser!B1,'sheet 2'!A38:I54,6))*0.1*VLOOKUP(Laser!B1,'sheet 2'!A38:I54,9)/30000","v":3.3333333333333335},{"$f":"((VLOOKUP(Laser!B1,'sheet 2'!A38:J54,10)*(Laser!F2*10))^2)*0.1*100000/30000","v":{"$error":"#VALUE!"}}]
[2,{"$f":"Laser!F2*VLOOKUP(Laser!B1,'sheet 2'!A38:J54,9)/30000","v":6.6666666666666671E-3},{"$f":"Laser!F2*100000/30000","v":6.666666666666667}]
[]
[]
[]
["Sublight (Maneuver) Drives"]
[]
[null,"Type","Thrust/m3"]
[1,{"$f":"VLOOKUP(Missile!B1,A73:G75,2)","v":"LF Rocket"},{"$f":"VLOOKUP(Missile!B1,A73:G75,3)","v":7.5},{"$f":"VLOOKUP(Missile!B1,A73:G75,4)","v":0.3},{"$f":"VLOOKUP(Missile!B1,A73:G75,5)","v":1500},{"$f":"VLOOKUP(Missile!B1,A73:G75,6)","v":7.5},{"$f":"VLOOKUP(Missile!B1,A73:G75,7)","v":"LRF"}]
[2,{"$f":"VLOOKUP(Missile!B1,A76:G78,2)","v":"AZHRAE"},{"$f":"VLOOKUP(Missile!B1,A76:G78,3)","v":9},{"$f":"VLOOKUP(Missile!B1,A76:G78,4)","v":0.5},{"$f":"VLOOKUP(Missile!B1,A76:G78,5)","v":0},{"$f":"VLOOKUP(Missile!B1,A76:G78,6)","v":4.5},{"$f":"VLOOKUP(Missile!B1,A76:G78,7)","v":"HRF"}]
[3,{"$f":"VLOOKUP(Missile!B1,A79:G83,2)","v":"SF Rocket"},{"$f":"VLOOKUP(Missile!B1,A79:G83,3)","v":0},{"$f":"VLOOKUP(Missile!B1,A79:G83,4)","v":0},{"$f":"VLOOKUP(Missile!B1,A79:G83,5)","v":5000},{"$f":"VLOOKUP(Missile!B1,A79:G83,6)","v":5.5},{"$f":"VLOOKUP(Missile!B1,A79:G83,7)","v":"SRF"}]
[4,"Fission Rocket"]
[5,"Fusion Rocket",9,0.35,null,3.5E-4,"LHyd"]
[6,"EAPlaC",null,null,null,0.3,"SFR"]
[7,"HEPlaR"]
[]
[0,"None"]
[5,"LF Rocket",6,0.25,15,7.5,"LRF"]
[6,"LF Rocket",7.5,0.3,1500,7.5,"LRF"]
[0,"None"]
[7,"HF Rocket",7.5,0.3,null,4.5,"HRF"]
[8,"AZHRAE",9,0.5,null,4.5,"HRF"]
[0,"None"]
[5,"SF Rocket",null,null,10,10.5,"SRF"]
[6,"SF Rocket",null,null,1000,9,"SRF"]
[7,"SF Rocket",null,null,2500,7.5,"SRF"]
[8,"SF Rocket",null,null,5000,5.5,"SRF"]
[]
[]
[]
[]
["Launch Canisters",1.1000000000000001,0.1,100]
["Reloadable Launchers",2,0.5,700]
["Autoloaded Launchers",4,0.5,700]
["Uses MFD to guide missiles"]
["Local guidance (laser comm)"]
["Remote station"]
["Manned (guidance, reloading)"]
[]
[]
[]
[]
["Nuclear-Pumped X-Ray Laser Warheads"]
["Tech Level","None","10 kt","20 kt","50 kt","100 kt","200 kt","500 kt","Yield","Price","Damage"]
[0,0,0,0,0,0,0,0,"None",0,0]
[8,0,0.28999999999999998,0.32,0.35,0.39,0.51,0.71,"10 kt",0.6,25]
[9,0,0.19500000000000001,0.215,0.23499999999999999,0.26500000000000001,0.35499999999999998,0.505,"20 kt",0.7,35]
[11,0,0.16,0.18,0.2,0.22,0.28000000000000003,0.38800000000000001,"50 kt",0.8,43]
[13,0,0.13200000000000001,0.14799999999999999,0.16800000000000001,0.188,0.248,0.35799999999999998,"100 kt",0.9,56]
[15,0,0.10299999999999999,0.113,0.127,0.14699999999999999,0.16700000000000001,0.247,"200 kt",1.1000000000000001,66]
[17,0,0.08,0.09,0.1,0.11,0.13,0.17,"500 kt",1.2,79]
[]
[]
[10,10,0]
[50,25,1]
[100,75,2]
[200,150,3]
[400,300,4]
[800,600,5]
[1600,1200,6]
[3200,2400,7]
[6400,4800,8]
[12800,9600,9]
[]
[]
["Type","Vol (m3)","Mass (ton)","Pow (MW)","Area (m2)","Price (MCr)","Crew","Short","Medium","Long","Extreme","Descript","Hits","BR","T4"]
["None",0,0,0,0,0,0]
["3 DT socket",42,0,0,10,5.0000000000000001E-3,0]
["6 DT socket",84,0,0,16,5.0000000000000001E-3,0]
[{"$f":"Laser!F3&\"-MJ \"&CHOOSE(Laser!B2,\"Laser Turret\",\"Laser Barbette\",\"Small Laser Bay\",\"Large Laser Bay\",\"Custom Laser Bay\",\"Spinal Laser\")","v":"200-MJ Laser Turret"},{"$f":"Laser!B27","v":42},{"$f":"Laser!C27","v":47.591000000000001},{"$f":"Laser!D27","v":161.6},{"$f":"Laser!E27","v":10},{"$f":"Laser!F27","v":1.7885},{"$f":"Laser!G27","v":1},{"$f":"Laser!H27","v":"6:1/11-35"},{"$f":"Laser!I27","v":"12:1/6-20"},{"$f":"Laser!J27","v":"24:1/3-10"},{"$f":"Laser!K27","v":"48:1/2-5"},{"$f":"Laser!A23","v":"TL-12 200-MJ Laser Turret (Loc:0-Arcs:0;161.6 MW;1 crew)"},{"$f":"Laser!B31","v":{"$error":"#NAME?"}},{"$f":"Laser!B28","v":{"$error":"#NAME?"}},{"$f":"Laser!B29","v":{"$error":"#NAME?"}}]
[{"$f":"IF(PAWS!F3>=1000,ROUND(PAWS!F3/1000,1)&\"-GJ\",PAWS!F3&\"-MJ\")&\" Particle Accelerator\"","v":"3.6-GJ Particle Accelerator"},{"$f":"PAWS!B25","v":1340},{"$f":"PAWS!C25","v":1896.4},{"$f":"PAWS!D25","v":100},{"$f":"PAWS!E25","v":10},{"$f":"PAWS!F25","v":67.804000000000002},{"$f":"PAWS!G25","v":2},{"$f":"PAWS!H25","v":"10:300"},{"$f":"PAWS!I25","v":"20:300"},{"$f":"PAWS!J25","v":"40:300"},{"$f":"PAWS!K25","v":"80:150"},{"$f":"PAWS!A21","v":"TL-14 3.6 GJ Particle Accelerator (Loc:0-Arcs:0;1000 MW;2 crew)"},{"$f":"PAWS!B28","v":{"$error":"#NAME?"}},{"$f":"PAWS!B26","v":{"$error":"#NAME?"}},{"$f":"PAWS!B27","v":{"$error":"#NAME?"}}]
[{"$f":"IF(Meson!F3>=1000,ROUND(Meson!F3/1000,1)&\" GJ\",Meson!F3&\" MJ\")&\" Meson Gun\"","v":"2.5 GJ Meson Gun"},{"$f":"Meson!B25","v":6865.6},{"$f":"Meson!C25","v":4756.8},{"$f":"Meson!D25","v":694.44399999999996},{"$f":"Meson!E25","v":25},{"$f":"Meson!F25","v":630.39200000000005},{"$f":"Meson!G14","v":16},{"$f":"Meson!H25","v":"6:250"},{"$f":"Meson!I25","v":"12:204"},{"$f":"Meson!J25","v":"24:102"},{"$f":"Meson!K25","v":"48:52"},{"$f":"Meson!A21","v":"TL-14 2.5 GJ Meson Gun (Loc:0-Arcs:0;694.444 MW;16 crew)"},{"$f":"Meson!B28","v":{"$error":"#NAME?"}},{"$f":"Meson!B26","v":{"$error":"#NAME?"}},{"$f":"Meson!B27","v":{"$error":"#NAME?"}}]
[{"$f":"CHOOSE(Missile!B2,\"Missile turret\",\"Missile barbette\",\"Small missile bay\",\"Large missile bay\",\"Custom missile bay\",\"Spinal missile bay\")","v":"Missile turret"},{"$f":"Missile!B27","v":42},{"$f":"Missile!C27","v":50.055999999999997},{"$f":"Missile!D27","v":0.15},{"$f":"Missile!E27","v":10},{"$f":"Missile!F27","v":0.15839999999999999},{"$f":"Missile!G27","v":0},null,null,null,null,{"$f":"Missile!A25","v":"TL-14 MissileTurret (Loc:0-Arcs:0;0.15 MW;No crew)"},{"$f":"Missile!A28","v":{"$error":"#NAME?"}}]
["Sand Caster",42,50,1,10,0.8,1,null,null,null,null,{"$f":"\"TL-xx Sand Caster (Loc:0-Arcs:0;1 MW;1 crew)\"","v":"TL-xx Sand Caster (Loc:0-Arcs:0;1 MW;1 crew)"}]
["LTR-144-4-2",42,77.44,40,10,1.048,0,{"$f":"\"4:1/10-30\"","v":"4:1/10-30"},{"$f":"\"8:1/10-30\"","v":"8:1/10-30"},{"$f":"\"16:1/6-20\"","v":"16:1/6-20"},{"$f":"\"32:1/3-10\"","v":"32:1/3-10"},"TL-xx 144","LT-1H"]
["LTR-121-10-2",42,71.709999999999994,33.61,10,1.5449999999999999,0,{"$f":"\"10:1/9-28\"","v":"10:1/9-28"},{"$f":"\"20:1/5-15\"","v":"20:1/5-15"},{"$f":"\"40:1/2-7\"","v":"40:1/2-7"},{"$f":"\"80:1-4\"","v":"80:1-4"},null,"LT-1H"]
["PX-10G-10-2",4152,6211.2,2777.78,16,186.00899999999999,6,{"$f":"\"10:500\"","v":"10:500"},{"$f":"\"20:500\"","v":"20:500"},{"$f":"\"40:500\"","v":"40:500"},{"$f":"\"80:250\"","v":"80:250"},null,"PA-62H"]
["MX-6.4G-6-2",13211,11533,1777.78,64,1167.07,35,{"$f":"\"6:400\"","v":"6:400"},{"$f":"\"12:200\"","v":"12:200"},{"$f":"\"24:100\"","v":"24:100"},{"$f":"\"48:50\"","v":"48:50"},null,"MG-116H"]
["LTR-144-10-4",42,69.36,160,10,2.04,0,{"$f":"\"10:1/10-30\"","v":"10:1/10-30"},{"$f":"\"10:1/10-30\"","v":"10:1/10-30"},{"$f":"\"10:1/10-30\"","v":"10:1/10-30"},{"$f":"\"10:1/10-30\"","v":"10:1/10-30"},null,"LT-1H"]
["LBR-324-10-4",84,{"$f":"135.697","v":135.697},360,10,1.2669999999999999,0,{"$f":"\"10:1/14-45\"","v":"10:1/14-45"},{"$f":"\"20:1/14-45\"","v":"20:1/14-45"},{"$f":"\"40:1/14-45\"","v":"40:1/14-45"},{"$f":"\"80:1/14-45\"","v":"80:1/14-45"},{"$f":"\"TL-14 324-MJ Laser Barbette (Loc:0-Arcs:0;360 MW;No crew)\"","v":"TL-14 324-MJ Laser Barbette (Loc:0-Arcs:0;360 MW;No crew)"},"LB-2H"]
[]
[]
[]
["LLM-180-1-2",1400,1459.7,5,71,256.65100000000001,1,9,"LL-15H"]
["LTM-64-6-2",42,54,1.778,10,2.3734999999999999,1,11]
[]
["LTM-115-5-2",42,63.85,31.94,10,1.0195000000000001,1,12]
["LTR-121-10-2",42,71.709999999999994,33.61,10,1.5449999999999999,0,12,"LT-1H",{"$f":"\"10:1/9-28\"","v":"10:1/9-28"},{"$f":"\"20:1/5-15\"","v":"20:1/5-15"},{"$f":"\"40:1/2-7\"","v":"40:1/2-7"},{"$f":"\"80:1-4\"","v":"80:1-4"}]
["LTR-144-4-2",42,77.44,40,10,1.048,0,12,"LT-1H",{"$f":"\"4:1/10-30\"","v":"4:1/10-30"},{"$f":"\"8:1/10-30\"","v":"8:1/10-30"},{"$f":"\"16:1/6-20\"","v":"16:1/6-20"},{"$f":"\"32:1/3-10\"","v":"32:1/3-10"}]
["MX-6.4G-6-2",13211,11533,1777.78,64,1167.07,35,12,"MG-116H",{"$f":"\"6:400\"","v":"6:400"},{"$f":"\"12:200\"","v":"12:200"},{"$f":"\"24:100\"","v":"24:100"},{"$f":"\"48:50\"","v":"48:50"}]
["PX-2.5G-10-2",2276.33,2460.6999999999998,69.444000000000003,31.545000000000002,167.19,6,12,"PA-25H"]
["PX-10G-10-2",4152,6211.2,2777.78,16,186.00899999999999,6,12,"PA-62H",{"$f":"\"10:500\"","v":"10:500"},{"$f":"\"20:500\"","v":"20:500"},{"$f":"\"40:500\"","v":"40:500"},{"$f":"\"80:250\"","v":"80:250"}]
["PX-10G-10-2",5787,7412.2,2777.78,32,346.01650000000001,11,12,"PA-74H",{"$f":"\"10:500\"","v":"10:500"},{"$f":"\"20:500\"","v":"20:500"},{"$f":"\"40:500\"","v":"40:500"},{"$f":"\"80:500\"","v":"80:500"}]
["PX-23G-10-2",8912,13662.2,6250,20,377.26650000000001,11,12]
[]
["LTR-135-10-2",41.725000000000001,72.099999999999994,37.5,10,1.5740000000000001,0,13,"LT-1H"]
["MX-40G-4-2",82518,72049.2,11111.1,400,7291.03,216,13,"MG-721H"]
["MX-10G-4-2",14506,13511.2,2777.78,100,1222.97,36,13,"MG-135H"]
["PX-10G-10-2",3829,5661.5,2777.78,30.68,176.91,5,13,"PA-57H"]
[]
["LTM-144-10-5",42,63.887,4,7.5477000000000002E-2,0.90700000000000003,1,14,"LT-1H"]
["LTR-144-10-5",34.887,63.686999999999998,4,7.5477000000000002E-2,0.90500000000000003,0,14,"LT-1H"]
["LTR-144-10-4",42,69.36,160,10,2.04,0,14,"LT-1H",{"$f":"\"10:1/10-30\"","v":"10:1/10-30"},{"$f":"\"10:1/10-30\"","v":"10:1/10-30"},{"$f":"\"10:1/10-30\"","v":"10:1/10-30"},{"$f":"\"10:1/10-30\"","v":"10:1/10-30"},"X-ray Grav, 4 MW"]
["LTR-150-10-4",42,72,166.667,10,2.1,0,14,"LT-1H",{"$f":"\"10:1/10-31\"","v":"10:1/10-31"},{"$f":"\"20:1/8-24\"","v":"20:1/8-24"},{"$f":"\"40:1/4-12\"","v":"40:1/4-12"},{"$f":"\"80:1/2-6\"","v":"80:1/2-6"},"Tunable Grav, 4.167 MW"]
["LTR-324-10-5",42,51.36,108,10,5.8810000000000002,0,14,"LT-1H",{"$f":"\"10:1/14-45\"","v":"10:1/14-45"},{"$f":"\"20:1/9-27\"","v":"20:1/9-27"},{"$f":"\"40:1/4-14\"","v":"40:1/4-14"},{"$f":"\"80:1/2-7\"","v":"80:1/2-7"},"X-ray Non-Grav, 1.35 MW"]
["LBR-324-10-4",84,148.56,360,10,3.84,0,14,"LB-2H",{"$f":"\"10:1/14-45\"","v":"10:1/14-45"},{"$f":"\"20:1/14-45\"","v":"20:1/14-45"},{"$f":"\"40:1/14-45\"","v":"40:1/14-45"},{"$f":"\"80:1/14-45\"","v":"80:1/14-45"},{"$f":"\"X-ray Grav, 9 MW\"","v":"X-ray Grav, 9 MW"}]
["LBR-324-10-4",84,148.56,360,10,3.84,0,14,"LB-2H",{"$f":"\"10:1/14-45\"","v":"10:1/14-45"},{"$f":"\"20:1/11-35\"","v":"20:1/11-35"},{"$f":"\"40:1/6-18\"","v":"40:1/6-18"},{"$f":"\"80:1/3-9\"","v":"80:1/3-9"},"Tunable Grav, 9 MW"]
["LBR-700-10-5",84,104,233.333,10,12.01,0,14,"LB-1H",{"$f":"\"10:1/21-66\"","v":"10:1/21-66"},{"$f":"\"20:1/13-40\"","v":"20:1/13-40"},{"$f":"\"40:1/6-20\"","v":"40:1/6-20"},{"$f":"\"80:1/3-10\"","v":"80:1/3-10"},"X-ray Non-Grav, 2.917 MW"]
["PX-360G-10-2",72620,144456.4,100000,1,780.60400000000004,2,14]
["MX-10G-8-2",22354.799999999999,16014.8,2777.7779999999998,100,2020.58,50,14]
[]
["PX-1G-10-2",376.75,497,27.777999999999999,7.67,21.227,1,15,"PA-5H"]
["PX-2G-10-2",960,1153.1890000000001,55.555999999999997,13.333,63.8,1,15,"PA-12H"]
["LTR-144-10-5",28.260999999999999,53.460999999999999,320,5.2999999999999999E-2,0.56399999999999995,0,15,"LT-1H"]
["LTM-144-10-4",42,59.36,160,10,1.706,1,15,"LT-1H"]

{"sheet":"Tab","index":13,"n_rows":86,"n_cols":17,"rows_kept":86,"cut":false,"hidden":false,"merged":[]}
["Bore (cm)","Mass (ton)","Energy (MJ)","Mass (kg)","Tech Level","ME Mult.",null,"Sights and Rangefinders",null,null,null,null,0,"#Not Available",0,0,0]
[0,0,0,0,0,0,null,{"$f":"CPRGun!J6","v":8},"Range","Mass (ton)","Price (MCr)",null,6,"analog",0.01,2E-3,1]
[2,0.1,0.06,0.2,4,0.8,null,"none",0.1,0,0,null,0,"#Not Available",0,0,0]
[3,0.12,0.15,0.4,5,1,null,"iron sight",0.2,5.0000000000000001E-3,2.5000000000000001E-4,null,8,"digital",0.02,5.0000000000000001E-3,2]
[4,0.16,0.35,0.8,7,1.2,null,{"$f":"IF(H2<5,\"#Not Available\",\"telescopic sight\")","v":"telescopic sight"},0.4,0.01,5.0000000000000001E-4,null,10,"digital",0.04,0.02,3]
[5,0.3,0.8,1.5,8,1.4,null,{"$f":"IF(H2<6,\"#Not Available\",\"optic rangefinder\")","v":"optic rangefinder"},0.6,0.02,1E-3,null,12,"digital",0.04,0.1,4]
[6,0.42,1.6,3,9,1.6,null,{"$f":"IF(H2<7,\"#Not Available\",\"laser rangefinder\")","v":"laser rangefinder"},0.8,0.04,5.0000000000000001E-3,null,0,"#Not Available",0,0,0]
[7,0.54,2.4,6,null,null,null,{"$f":"IF(H2<8,\"#Not Available\",\"imaging radar\")","v":"imaging radar"},1.6,0.06,0.01,null,14,"synaptic",0.03,0.5,5]
[8,0.6,3.6,12,null,null,null,{"$f":"IF(H2<10,\"#Not Available\",\"EMS rangefinder\")","v":"#Not Available"},3,0.08,0.02,null,16,"synaptic",0.02,1,6]
[9,1,4.9000000000000004,17,"Smoothbore range",null,null,null,null,null,null,null,0,"#Not Available",0,0,0]
[10,1.2,6,21,0,1,null,null,null,null,null,null,18,"fluidic",0.02,2,7]
[11,1.5,7.7,25,7,1.1499999999999999,null,"Ballistic Computers"]
[12,2.1,9.3000000000000007,30,8,1.3,null,"Type","Mass (ton)","Price (MCr)","Diff Mod"]
[13,2.7,11.7,35,9,1.45,null,"none",0,0,0]
[14,3.3,15,43,null,null,null,{"$f":"VLOOKUP(H2,M1:Q2,2)","v":"analog"},{"$f":"VLOOKUP(H2,M1:Q2,3)","v":0.01},{"$f":"VLOOKUP(H2,M1:Q2,4)","v":2E-3},{"$f":"VLOOKUP(H2,M1:Q2,5)","v":1},null,null,"gun"]
[15,4,18.600000000000001,50,"Loading time",null,null,{"$f":"VLOOKUP(H2,M3:Q6,2)","v":"digital"},{"$f":"VLOOKUP(H2,M3:Q6,3)","v":0.02},{"$f":"VLOOKUP(H2,M3:Q6,4)","v":5.0000000000000001E-3},{"$f":"VLOOKUP(H2,M3:Q6,5)","v":2},null,null,"autocannon"]
[16,4.5,23,60,0,1,null,{"$f":"VLOOKUP(H2,M7:Q9,2)","v":"#Not Available"},{"$f":"VLOOKUP(H2,M7:Q9,3)","v":0},{"$f":"VLOOKUP(H2,M7:Q9,4)","v":0},{"$f":"VLOOKUP(H2,M7:Q9,5)","v":0},null,null,"mortar"]
[17,6,29,72,6,0.9,null,{"$f":"VLOOKUP(H2,M10:Q11,2)","v":"#Not Available"},{"$f":"VLOOKUP(H2,M10:Q11,3)","v":0},{"$f":"VLOOKUP(H2,M10:Q11,4)","v":0},{"$f":"VLOOKUP(H2,M10:Q11,5)","v":0}]
[18,7.5,36,85,7,0.7,null,null,null,null,null,null,null,"chemical"]
[19,9,41,100,8,0.5,null,null,null,null,null,null,null,{"$f":"IF(H2<9,\"#Not Available\",\"ETC\")","v":"#Not Available"}]
[20,11,48,115,9,0.3]
[21,13,55,140,null,null,null,0,0,0,null,"none",null,"rifled"]
[22,15,63,160,null,null,null,4,0.05,4.0000000000000001E-3,null,"indirect fire sight",null,{"$f":"IF(OR(CPRGun!J6<7,CPRGun!J10=3),\"#Not Available\",\"smoothbore\")","v":"smoothbore"}]
[23,17,72,185,null,null,null,5,0.05,6.0000000000000001E-3]
[24,19,83,215,null,null,null,6,7.4999999999999997E-2,8.0000000000000002E-3,null,"vehicle mount",null,"Normal"]
[25,21,96,250,null,null,null,7,0.1,0.01,null,"carriage",null,{"$f":"IF(CPRGun!J6<5,\"#Not Available\",\"RAP\")","v":"RAP"}]
[30,30,150,500,null,null,null,8,0.2,0.02,null,{"$f":"IF(CPRGun!J10=3,\"baseplate and bipod\",\"#Not Available\")","v":"#Not Available"},null,{"$f":"IF(CPRGun!J6<7,\"#Not Available\",\"BB\")","v":"BB"}]
[35,40,230,1000,null,null,null,9,0.2,0.1]
[40,50,350,2500,null,null,null,10,0.2,0.15]
[45,60,500,5000,null,null,null,11,0.2,0.2,null,null,null,"single shot",null,"manual loader"]
[50,null,null,10000,null,null,null,15,0.1,0.25,null,null,null,"mechanical loader",null,"autoloader"]
[null,null,null,null,null,null,null,16,0.1,0.3,null,"none",null,{"$f":"IF(CPRGun!J10=3,\"#Not Available\",\"autoloader\")","v":"autoloader"},null,"autocannon"]
[null,"Mass Mod",null,null,null,null,null,18,0.05,0.35,null,"gun shield",null,{"$f":"IF(CPRGun!J10=3,\"#Not Available\",\"recoil-operated\")","v":"recoil-operated"}]
["HE",1,null,10,null,null,null,21,0.05,0.4,null,null,null,{"$f":"IF(CPRGun!J10=3,\"#Not Available\",\"electric\")","v":"electric"}]
["KEAP",2,1,5]
["HVAP",1.5,1.3,15,null,null,null,"Stabilization"]
["APDS",1,1.7,15,null,null,null,"Type","Mass (ton)","Price (MCr)","Fire if Move"]
["APFSDS",1,2.4,15,null,null,null,"none",0,0,"stationary"]
["APFSDSDU",1,3,30,null,null,null,{"$f":"IF(H2<6,\"#Not Available\",\"basic\")","v":"basic"},0.05,0.02,"full safe speed"]
["APFSDSCI",1,4.5,35,null,null,null,{"$f":"IF(H2<7,\"#Not Available\",\"good\")","v":"good"},7.4999999999999997E-2,0.04,"twice safe speed"]
["APFSDSSD",1,5,40,null,null,null,{"$f":"IF(H2<8,\"#Not Available\",\"advanced\")","v":"advanced"},0.1,0.05,"any speed"]
["APFSDSBSD",1,6,45]
["APFSDSBCSD",1,7,50,null,"HE damage",null,"KEAP penetration",null,null,null,"HEAP penetration"]
["HEAP",1,null,15,null,0,0,0,22,5,null,0,0]
["SEFOP",1,null,20,null,4,7.4999999999999997E-2,0.3,16,6,null,5,4]
["CHEM",1,null,10,null,5,0.1,0.5,12,10,null,6,6]
["WP/IS",1,null,20,null,6,0.125,1,10,12,null,7,8]
["ILLUM",1,null,10,null,7,0.15,1.5,8,35,null,8,10]
["SM",1,null,60,null,8,0.17499999999999999,5,7,43,null,9,12]
["SM (Homing)",1,null,100,null,9,0.2,7,6,45]
["RDM",1,null,100,null,10,0.25,9,5,48]
["Flechette",1,null,50,null,null,null,12,4,999]
["Chaff",1,null,20]
[null,null,null,null,null,null,null,"ILLUM burst radius"]
["Tech Level","HPG","Battery","Density","Cr/dm3",null,null,0,0]
[3,0,null,null,null,null,null,4,2.5]
[4,0,0.04,2,1,null,null,5,3]
[5,0,0.06,2,1,null,null,8,3.5]
[6,0,0.08,2,0.8,null,null,10,4]
[7,0.25,0.1,2,0.8]
[8,0.125,0.2,2,1]
[9,0.1,0.4,2,2]
[10,0.08,0.8,2,3]
[11,0.06,1,2,4]
[12,0.05,1.5,2,5]
[13,4.4999999999999998E-2,2,2.5,8]
[14,0.04,2.5,2.5,10]
[15,3.5000000000000003E-2,3,2.5,15]
[16,0.03,3.5,2.5,20]
[17,2.5000000000000001E-2,4,2.5,25]
[18,0.02,6,3,30]
[19,1.4999999999999999E-2,8,4,40]
[20,0.01,10,5,50]
[21,5.0000000000000001E-3,12,6,100]
[]
[]
[null,null,"Tech Level","Gauss Efficiency"]
[null,null,8,4.5]
[null,null,9,3.6]
[null,null,10,3]
[null,null,11,2.4]
[null,null,12,2]
[null,null,13,1.8]
[null,null,14,1.6]
[null,null,16,1.4]
[null,null," "]

{"sheet":"CPRGun","index":14,"n_rows":66,"n_cols":11,"rows_kept":66,"cut":false,"hidden":false,"merged":[]}
["Ammo","Vol (dm3)","Mass (kg)",null,"Price (Cr)"]
["Warhead",{"$f":"C2/5","v":6},{"$f":"(VLOOKUP(J7,Tab!A2:D31,4) + (VLOOKUP(J7+IF(J7>25,5,1),Tab!A2:D31,4)-VLOOKUP(J7,Tab!A2:D31,4))*(J7-FLOOR(J7,1))) * INDEX(Tab!B34:B53,F2)","v":30},null,{"$f":"C2*INDEX(Tab!D34:D53,F2)","v":300},1]
["Propellant",{"$f":"C3/5","v":2.1},{"$f":"0.007*C2*J8 + IF(F3=2,1,0)*C2","v":10.5},null,{"$f":"5*C3 * IF(F3=1,1,2)","v":52.5},1]
[null,{"$f":"SUM(B2:B3)","v":8.1},{"$f":"SUM(C2:C3)","v":40.5},null,{"$f":"ROUND(SUM(E2:E3),2)","v":352.5}]
[]
["Weapon","Vol (m3)","Mass (ton)","Len (cm)","Price (MCr)",1,{"$f":"IF(AND(F6>1,J10<>2),\"Error: single barrel only\",\"barrel\"&IF(F6=1,\"\",\"s\"))","v":"barrel"},null,"Tech Level",8]
["Gun Tube",{"$f":"C7","v":1.8900000000000001},{"$f":"IF(J10=3,J7*D7*0.02/1000,(VLOOKUP(J7,Tab!A3:C30,2) + (VLOOKUP(J7+IF(J7>25,5,1),Tab!A3:C30,2)-VLOOKUP(J7,Tab!A3:C30,2))*(J7-FLOOR(J7,1))) * (1+(J8-60)*0.01) * (1+(F6-1)*0.3))","v":1.8900000000000001},{"$f":"J7*J8","v":600},{"$f":"C7*0.02","v":3.78E-2},2,null,null,"Bore Size",12,{"$f":"IF(AND(J10=2,J7>2+(J6-4)*2),2+(J6-4)*2&\" cm max\",\"cm\")","v":"cm"}]
["Loader",{"$f":"C8","v":0},{"$f":"((VLOOKUP(J7,Tab!A3:C30,2) + (VLOOKUP(J7+IF(J7>25,5,1),Tab!A3:C30,2)-VLOOKUP(J7,Tab!A3:C30,2))*(J7-FLOOR(J7,1))) * (1+(J8-60)*0.01)) * CHOOSE(F8,0,0.1,0,1,0.3) + IF(F8=3,C4*30/1000,0)","v":0},0,{"$f":"C8*CHOOSE(F8,1,0.01,0.01,0.003,0.01)","v":0},1,null,null,"Length",50,{"$f":"IF(J8>CHOOSE(J10,100,100,20),CHOOSE(J10,100,100,20)&\" calibers max\",\"calibers\")","v":"calibers"}]
["Carriage",{"$f":"C9","v":0},{"$f":"IF(J10=3,C7*CHOOSE(F9,0,2,1.6),IF(F9=1,0,MAX(C7,J9/2,IF(F8>3,J9*J19/4,0))))","v":0},0,{"$f":"C9*0.002","v":0},1,null,null,"Muzzle E",{"$f":"(VLOOKUP(J7,Tab!A3:C30,3) + (VLOOKUP(J7+IF(J7>25,5,1),Tab!A3:C30,3)-VLOOKUP(J7,Tab!A3:C30,3))*(J7-FLOOR(J7,1))) * (1+IF(J8>60,(J8-60)*0.01,0)-IF(J8<60,(IF(J8<20,0.8,(60-J8)*0.02) + IF(J8<20,(20-J8)*0.01,0)),0)) * IF(J11=2,2.5,VLOOKUP(J6,Tab!E2:F7,2))","v":10.416},"MJ"]
["Shield",{"$f":"C10","v":0},{"$f":"IF(F10=1,0,J7*0.07)","v":0},0,{"$f":"C10*0.001","v":0},1,null,null,"Type",1]
["HPG",{"$f":"VLOOKUP(J6,Tab!A56:B74,2)*F11","v":0},{"$f":"B11*2","v":0},0,{"$f":"B11*0.01","v":0},{"$f":"IF(J11=1,0,J9*0.06)","v":0},"MJ",null,"Propellant",1]
["Sights",{"$f":"C12","v":0.04},{"$f":"INDEX(Tab!J3:J9,F12)","v":0.04},0,{"$f":"INDEX(Tab!K3:K9,F12)","v":5.0000000000000001E-3},5,null,null,"Range",{"$f":"INDEX(Tab!I3:I9,F12)","v":0.8},"km"]
["Ball Comp",{"$f":"C13","v":0.02},{"$f":"IF(F13=1,0,INDEX(Tab!I14:I18,F13))","v":0.02},0,{"$f":"IF(F13=1,0,INDEX(Tab!J14:J18,F13))","v":5.0000000000000001E-3},3,null,null,"Diff Mod",{"$f":"INDEX(Tab!K14:K18,F13)","v":2}]
["IDF Sight",{"$f":"C14","v":0},{"$f":"IF(F14=1,0,VLOOKUP(J6,Tab!H22:J34,2))","v":0},0,{"$f":"IF(F14=1,0,VLOOKUP(J6,Tab!H22:J34,3))","v":0},1]
["Stabilizat",{"$f":"C15","v":0.1},{"$f":"INDEX(Tab!I38:I41,F15)","v":0.1},0,{"$f":"INDEX(Tab!J38:J41,F15)","v":0.05},4,null,null,{"$f":"\"Fire at \"&INDEX(Tab!K38:K41,F15)","v":"Fire at any speed"}]
[null,{"$f":"ROUND(SUM(B7:B15),3)","v":2.0499999999999998},{"$f":"SUM(C7:C15)","v":2.0500000000000003},{"$f":"ROUND(SUM(D7:D15),1)","v":600},{"$f":"CEILING(SUM(E7:E15),0.000001)","v":9.7799999999999998E-2},null,null,null,{"$f":"IF(F9=2,4,0)*J7","v":0},"turns to set up for direct fire"]
[null,null,null,null,null,null,null,null,{"$f":"IF(F9=1,4,8)*J7","v":48},"turns to set up for indirect fire"]
[]
["Magazine","Vol (dm3)","Mass (kg)",null,"Price (Cr)",null,null,null,"ROF",{"$f":"IF(F8<4,1,FLOOR(40/J7*IF(F6=1,1,F6/2),1))","v":1},"rounds/turn"]
["Frame",{"$f":"C21/2","v":202.5},{"$f":"C21*0.01","v":4.05},null,{"$f":"C20*5","v":20.25},10,"rounds",null,"Reload",{"$f":"IF(F8<4,MAX(1,ROUND(J9*IF(OR(F8=2,F8=3),VLOOKUP(J6,Tab!E17:F21,2),1),0)),0)","v":10},"turns"]
["Ammo",0,{"$f":"F20*C4","v":405},null,0]
["Battery",{"$f":"(F20*F11)/(VLOOKUP(J6,Tab!A56:E74,3)*3600)","v":0},null,null,null,null,null,null,"Range",{"$f":"ROUND(IF(F7=1,1,VLOOKUP(J6,Tab!E11:F14,2))*5*(J7+J8+20)/10,0)*10","v":530},"m"]
[null,{"$f":"SUM(B20:B22)","v":202.5},{"$f":"SUM(C20:C22)","v":409.05},null,{"$f":"CEILING(SUM(E20:E22),1)","v":21},{"$f":"CEILING(C24*10,1)","v":5},"turns to change",null,null,{"$f":"ROUND(IF(F7=1,1,VLOOKUP(J6,Tab!E11:F14,2))*0.75*5*(J7+J8+20)/10,0)*10","v":400},"m"]
[null,{"$f":"ROUND(B23/1000,3)","v":0.20300000000000001},{"$f":"ROUND(C23/1000,3)","v":0.40899999999999997},null,{"$f":"ROUND(E23/1000,3)","v":2.1000000000000001E-2},null,null,null,"Indirect",{"$f":"ROUND(SQRT(J7)*(J8+MAX(0,J6-4))*0.13*CHOOSE(F3,1,1.5,1.2),1)","v":24.3},"km"]
["Total",{"$f":"B16+B24","v":2.2529999999999997},{"$f":"C16+C24","v":2.4590000000000001}]
[null,null,null,null,null,null,null,null,"Gun Crew",{"$f":"IF(F8>2,1,IF(F9=1,MAX(2,CEILING(J7/6,1)),CEILING(J7/3,1)))","v":2},"direct fire"]
["Weapon Type:",null,{"$f":"\"TL-\"&J6&\" \"&J7*10&\"/L\"&J8&\" \"&IF(F6=1,\"\",F6&\"-barrel \")&INDEX(Tab!N22:N23,F7)&\" \"&IF(J10=2,INDEX(Tab!N30:N34,F8)&\" \",\"\")&INDEX(Tab!N15:N17,J10)","v":"TL-8 120/L50 smoothbore gun"},null,null,null,null,null,null,{"$f":"IF(F8>2,1,IF(F9=1,MAX(2,CEILING(J7/2,1)),J7))","v":6},"indirect fire"]
["Ammunition:",null,{"$f":"J7*10&\" mm \"&IF(F3=1,\"\",INDEX(Tab!N25:N27,F3))","v":"120 mm "}]
["Muzzle Energy:",null,{"$f":"ROUND(J9,3)&\" MJ\"","v":"10.416 MJ"}]
["Weapon Length:",null,{"$f":"D16&\" cm gun tube\"","v":"600 cm gun tube"}]
["Weapon Mass:",null,{"$f":"C16&\" ton \"&INDEX(Tab!L25:L27,F9)","v":"2.05 ton vehicle mount"}]
["Weapon Price:",null,{"$f":"E16&\" MCr\"","v":"0.0978 MCr"}]
["Magazine Mass:",null,{"$f":"C24&\" ton, (\"&F20&\" rounds), \"&F23&\" turns to change magazine\"","v":"0.409 ton, (10 rounds), 5 turns to change magazine"}]
["Magazine Price:",null,{"$f":"\"Cr \"&E23","v":"Cr 21"}]
["Gun Crew:",null,{"$f":"IF(F14=1,J26&\" for direct fire\",IF(J26=J27,J26&\" for direct or indirect fire\",J26&\" for direct fire, \"&J27&\" for indirect fire\"))&IF(I16>0,\", \"&I16&\" turns to set up for direct fire\",\"\")&IF(AND(F14=1,I17>0),\"\",\", \"&I17&\" turns to set up for indirect fire\")","v":"2 for direct fire"}]
["Volume:",null,{"$f":"B25&\" m3 (\"&B16&\" m3 gun, \"&B24&\" m3 magazine)\"","v":"2.253 m3 (2.05 m3 gun, 0.203 m3 magazine)"}]
["Features:",null,{"$f":"IF(F6=1,INDEX(Tab!N22:N23,F7)&\" barrel\",F6&\" \"&INDEX(Tab!N22:N23,F7)&\" barrels\")&\", \"&INDEX(Tab!N30:N34,F8)&\" action\"&IF(F9=2,\", carriage\",\"\")&IF(F10=2,\", gun shield\",\"\")&IF(F12=1,\"\",\", \"&INDEX(Tab!H3:H9,F12))&IF(F13=1,\"\",\", \"&INDEX(Tab!H14:H18,F13)&\" ballistic computer\")&IF(F14=1,\"\",\", indirect fire sight\")&IF(F15=1,\"\",\", \"&INDEX(Tab!H38:H41,F15)&\" stabilization\")","v":"smoothbore barrel, single shot action, laser rangefinder, digital ballistic computer, advanced stabilization"}]
["Notes:",null,{"$f":"\"Using small-arms damage formula, the KE damage value is \"&ROUND(1000*SQRT(J9)/15,0)&\". \"&IF(F12=1,\"\",\"Range finder ignores \"&J13&\" Diff Mods.\")","v":"Using small-arms damage formula, the KE damage value is 215. Range finder ignores 2 Diff Mods."}]
[]
[{"$f":"J7*10&\"/L\"&J8&\" \"&INDEX(Tab!N15:N17,J10)","v":"120/L50 gun"},null,{"$f":"IF(J20=0,\"ROF\",\"Reload\")","v":"Reload"},"S Range","IFR"]
["Kinetic Penetrators",null,{"$f":"IF(J20=0,J19&\"/turn\",J20&\" turn\"&IF(J20=1,\"\",\"s\"))","v":"10 turns"},{"$f":"MIN(1000*J12,J22)","v":530},{"$f":"IF(F14=1,\"None\",J24)","v":"None"}]
["Non-kinetic warheads",null,{"$f":"C41","v":"10 turns"},{"$f":"MIN(1000*J12,J23)","v":400},{"$f":"E41","v":"None"}]
[]
["Kinetic Penetrators",null,"Damage Value",null,"Pen Val",null,"Mass (kg)","Price (Cr)",null,{"$f":"J45*1.15","v":55.199999999999996},"Short Pen"]
["KEAP (AP)",null,{"$f":"C46","v":"DV: 26 (215)"},null,{"$f":"ROUND(J44,0)&\"/\"&ROUND(J45,0)&\"/\"&ROUND(J46,0)&\"/\"&ROUND(J47,0)","v":"55/48/41/26"},null,{"$f":"J51*2","v":81},{"$f":"(J49*5+J52)*2","v":405},null,{"$f":"ROUND(MIN(J9*VLOOKUP(J9,Tab!H44:J52,2),VLOOKUP(J9,Tab!H44:J52,3)),0)","v":48},"Med Pen"]
[{"$f":"IF(J6<5,\"#Not Available\",\"HVAP\")","v":"HVAP"},null,{"$f":"\"DV: \"&ROUND(J7*2.2,0)&\" (\"&ROUND(1000*SQRT(J9)/15,0)&\")\"","v":"DV: 26 (215)"},null,{"$f":"ROUND(J44*1.3,0)&\"/\"&ROUND(J45*1.3,0)&\"/\"&ROUND(J46*1.3,0)&\"/\"&ROUND(J47*1.3,0)","v":"72/62/53/34"},null,{"$f":"J51*1.5","v":60.75},{"$f":"(J49*15+J52)*1.5","v":753.75},null,{"$f":"J45*0.85","v":40.799999999999997},"Long Pen"]
[{"$f":"IF(J6<6,\"#Not Available\",\"APDS\")","v":"APDS"},null,{"$f":"C46","v":"DV: 26 (215)"},null,{"$f":"ROUND(J44*1.7,0)&\"/\"&ROUND(J45*1.7,0)&\"/\"&ROUND(J46*1.7,0)&\"/\"&ROUND(J47*1.7,0)","v":"94/82/69/45"},null,{"$f":"J51","v":40.5},{"$f":"J52+J49*15","v":502.5},null,{"$f":"J45*0.55","v":26.400000000000002},"Extreme Pen"]
[{"$f":"IF(J6<7,\"#Not Available\",\"APFSDS\")","v":"APFSDS"},null,{"$f":"C46","v":"DV: 26 (215)"},null,{"$f":"ROUND(J44*2.4,0)&\"/\"&ROUND(J45*2.4,0)&\"/\"&ROUND(J46*2.4,0)&\"/\"&ROUND(J47*2.4,0)","v":"132/115/98/63"},null,{"$f":"J51","v":40.5},{"$f":"J52+J49*15","v":502.5}]
[{"$f":"IF(J6<8,\"#Not Available\",\"APFSDSDU\")","v":"APFSDSDU"},null,{"$f":"C46","v":"DV: 26 (215)"},null,{"$f":"ROUND(J44*3,0)&\"/\"&ROUND(J45*3,0)&\"/\"&ROUND(J46*3,0)&\"/\"&ROUND(J47*3,0)","v":"166/144/122/79"},null,{"$f":"J51","v":40.5},{"$f":"J52+J49*30","v":952.5},null,{"$f":"(VLOOKUP(J7,Tab!A2:D31,4) + (VLOOKUP(J7+IF(J7>25,5,1),Tab!A2:D31,4)-VLOOKUP(J7,Tab!A2:D31,4))*(J7-FLOOR(J7,1)))","v":30},"Warhead Mass"]
[{"$f":"IF(J6<10,\"#Not Available\",\"APFSDSCI\")","v":"#Not Available"},null,{"$f":"C46","v":"DV: 26 (215)"},null,{"$f":"ROUND(J44*4.5,0)&\"/\"&ROUND(J45*4.5,0)&\"/\"&ROUND(J46*4.5,0)&\"/\"&ROUND(J47*4.5,0)","v":"248/216/184/119"},null,{"$f":"J51","v":40.5},{"$f":"J52+J49*35","v":1102.5},null,{"$f":"0.007*J49*J8 + IF(F3=2,1,0)*C2","v":10.5},"Propellant Mass"]
[{"$f":"IF(J6<12,\"#Not Available\",\"APFSDSSD\")","v":"#Not Available"},null,{"$f":"C46","v":"DV: 26 (215)"},null,{"$f":"ROUND(J44*5,0)&\"/\"&ROUND(J45*5,0)&\"/\"&ROUND(J46*5,0)&\"/\"&ROUND(J47*5,0)","v":"276/240/204/132"},null,{"$f":"J51","v":40.5},{"$f":"J52+J49*40","v":1252.5},null,{"$f":"J49+J50","v":40.5},"Total mass"]
[{"$f":"IF(J6<14,\"#Not Available\",\"APFSDSBSD\")","v":"#Not Available"},null,{"$f":"C46","v":"DV: 26 (215)"},null,{"$f":"ROUND(J44*6,0)&\"/\"&ROUND(J45*6,0)&\"/\"&ROUND(J46*6,0)&\"/\"&ROUND(J47*6,0)","v":"331/288/245/158"},null,{"$f":"J51","v":40.5},{"$f":"J52+J49*45","v":1402.5},null,{"$f":"ROUND(J50*5 * IF(F3=1,1,2),2)","v":52.5},"Propellant Price"]
[{"$f":"IF(J6<17,\"#Not Available\",\"APFSDSBCS\")","v":"#Not Available"},null,{"$f":"C46","v":"DV: 26 (215)"},null,{"$f":"ROUND(J44*7,0)&\"/\"&ROUND(J45*7,0)&\"/\"&ROUND(J46*7,0)&\"/\"&ROUND(J47*7,0)","v":"386/336/286/185"},null,{"$f":"J51","v":40.5},{"$f":"J52+J49*50","v":1552.5}]
[]
["Non-kinetic warheads",null,"Conc/Burst",null,"Pen Val",null,"Mass (kg)","Price (Cr)"]
["HE",null,{"$f":"\"C: \"&ROUND(VLOOKUP(J6,Tab!F44:G51,2)*J7^2,0)&\", B: \"&ROUND(SQRT(ROUND(VLOOKUP(J6,Tab!F44:G51,2)*J7^2,0))*IF(J10=3,10,7)/5,0)*5","v":"C: 25, B: 35"},null,{"$f":"IF(J7*1.5-7<0,\"Nil\",ROUND(J7*1.5-7,0)&\"C\")","v":"11C"},null,{"$f":"J51","v":40.5},{"$f":"J52+J49*10","v":352.5}]
["HEAP",null,{"$f":"\"C: \"&ROUND(VLOOKUP(J6,Tab!F44:G51,2)*J7^2*0.66,0)&\", B: \"&ROUND(SQRT(ROUND(VLOOKUP(J6,Tab!F44:G51,2)*J7^2,0))*0.66*IF(J10=3,10,7)/5,0)*5","v":"C: 17, B: 25"},null,{"$f":"IF(J7*VLOOKUP(J6,Tab!L44:M49,2)-7<0,\"Nil\",ROUND(J7*VLOOKUP(J6,Tab!L44:M49,2)-7,0)&\"C\")","v":"113C"},null,{"$f":"J51","v":40.5},{"$f":"J52+J49*15","v":502.5}]
["SEFOP",null,{"$f":"\"C: \"&ROUND(VLOOKUP(J6,Tab!F44:G51,2)*J7^2*0.5,0)&\", B: \"&ROUND(SQRT(ROUND(VLOOKUP(J6,Tab!F44:G51,2)*J7^2,0))*IF(J10=3,10,7)/5,0)*5","v":"C: 13, B: 35"},null,{"$f":"E57","v":"113C"},null,{"$f":"J51","v":40.5},{"$f":"J52+J49*20","v":652.5}]
["CHEM",null,{"$f":"\"C: \"&IF(J7<10,2,3)&\", B: \"&ROUND(0.2*J7^2/8,0)*5","v":"C: 3, B: 20"},null,"Nil",null,{"$f":"J51","v":40.5},{"$f":"J52+J49*10","v":352.5}]
["WP",null,{"$f":"\"C: \"&IF(J7<10,2,3)&\", B: \"&ROUND(0.2*J7*IF(J7<10,2,3),0)*5","v":"C: 3, B: 35"},null,"Nil",null,{"$f":"J51","v":40.5},{"$f":"J52+J49*20","v":652.5}]
["ILLUM",null,{"$f":"\"B: \"&ROUND(0.2*(J7*VLOOKUP(J6,Tab!H55:I59,2))^2,0)*5","v":"B: 1765"},null,"Nil",null,{"$f":"J51","v":40.5},{"$f":"J52+J49*10","v":352.5}]
["Submunition",null,{"$f":"\"B: \"&ROUND(0.2*0.25*J7^2,0)*5","v":"B: 35"},null,"As submunition",null,{"$f":"J51","v":40.5},{"$f":"J52+J49*60","v":1852.5}]
[{"$f":"IF(J6<9,\"#Not Available\",\"Homing Submunition\")","v":"#Not Available"},null,{"$f":"\"B: \"&ROUND(0.2*0.125*J7^2,0)*5","v":"B: 20"},null,"As submunition",null,{"$f":"J51","v":40.5},{"$f":"J52+J49*100","v":3052.5}]
["RDM",null,{"$f":"\"B: \"&ROUND(0.2*0.5*J7^2,0)*5","v":"B: 70"},null,"As mines",null,{"$f":"J51","v":40.5},{"$f":"J52+J49*100","v":3052.5}]
["Flechette",null,{"$f":"\"DS: \"&ROUND(0.02*J23,0)*5&\"x\"&ROUND(0.2*0.2*J23,0)*5","v":"DS: 40x80"},null,{"$f":"\"1-Nil\"","v":"1-Nil"},null,{"$f":"J51","v":40.5},{"$f":"J52+J49*50","v":1552.5}]
["Chaff",null,{"$f":"C61","v":"B: 1765"},null,"Nil",null,{"$f":"J51","v":40.5},{"$f":"J52+J49*20","v":652.5}]

{"sheet":"Gauss","index":15,"n_rows":66,"n_cols":14,"rows_kept":66,"cut":false,"hidden":false,"merged":[]}
["Ammo","Vol (dm3)","Mass (kg)",null,"Price (Cr)"]
["Warhead",{"$f":"C2/5","v":9.0919867500000002},{"$f":"(((J7/2)*(J7/2)*(J7/2)*3.1416)/10)","v":45.459933749999998},null,{"$f":"C2*INDEX(Tab!D34:D53,F2)","v":227.29966875},2]
["Propellant",null,null,null,{"$f":"5*C3 * IF(F3=1,1,2)","v":0}]
[null,{"$f":"SUM(B2:B3)","v":9.0919867500000002},{"$f":"SUM(C2:C3)","v":45.459933749999998},null,{"$f":"ROUND(SUM(E2:E3),2)","v":227.3}]
[]
["Weapon","Vol (m3)","Mass (ton)","Len (cm)","Price (MCr)",1,{"$f":"IF(AND(F6>1,J10<>2),\"Error: single barrel only\",\"barrel\"&IF(F6=1,\"\",\"s\"))","v":"barrel"},null,"Tech Level",12,{"$f":"IF(J6<8,\"Error: Minumum tech level 8\",\" \")","v":" "}]
["Gun",{"$f":"C7","v":2.2050000000000001},{"$f":"J7*J7/50","v":2.2050000000000001},0,{"$f":"C7*0.02","v":4.41E-2},null,null,null,"Bore Size",10.5,{"$f":"IF(AND(J10=2,J7>2+(J6-4)*2),2+(J6-4)*2&\" cm max\",\"cm\")","v":"cm"}]
["Loader",{"$f":"C8","v":0},{"$f":"IF(F8=1,0,IF(F8=2,30*C2/1000,50*C2/1000))","v":0},0,{"$f":"C8*CHOOSE(F8,1,0.01,0.01,0.003,0.01)","v":0},1,null,null,"Muzzle V",3000,"meters/second",null,{"$f":"IF(J6>11,6000,((J6-5)*1000))","v":6000},"m/s max. velocity"]
["Carriage",{"$f":"C9","v":0},{"$f":"IF(J10=3,C7*CHOOSE(F9,0,2,1.6),IF(F9=1,0,MAX(C7,J9/2,IF(F8>3,J9*J19/4,0))))","v":0},0,{"$f":"C9*0.002","v":0},1,null,null,"Muzzle E",{"$f":"(0.0000005*C2*J8*J8)","v":204.56970187499999},"MJ"]
["Shield",{"$f":"C10","v":0},{"$f":"IF(F10=1,0,J7*0.07)","v":0},0,{"$f":"C10*0.001","v":0},1]
["HPG",{"$f":"VLOOKUP(J6,Tab!A56:B74,2)*F11","v":20.456970187500001},{"$f":"B11*2","v":40.913940375000003},0,{"$f":"B11*0.01","v":0.20456970187500001},{"$f":"J11","v":409.13940374999999},"MJ",null,"Req. E",{"$f":"(VLOOKUP(J6,Tab!C78:D85,2)*J9)","v":409.13940374999999},"MJ"]
["Sights",{"$f":"C12","v":0},{"$f":"INDEX(Tab!J3:J9,F12)","v":0},0,{"$f":"INDEX(Tab!K3:K9,F12)","v":0},1,null,null,"Range",{"$f":"INDEX(Tab!I3:I9,F12)","v":0.1},"km"]
["Ball Comp",{"$f":"C13","v":0},{"$f":"IF(F13=1,0,INDEX(Tab!I14:I18,F13))","v":0},0,{"$f":"IF(F13=1,0,INDEX(Tab!J14:J18,F13))","v":0},1,null,null,"Diff Mod",{"$f":"INDEX(Tab!K14:K18,F13)","v":0}]
["IDF Sight",{"$f":"C14","v":0},{"$f":"IF(F14=1,0,VLOOKUP(J6,Tab!H22:J34,2))","v":0},0,{"$f":"IF(F14=1,0,VLOOKUP(J6,Tab!H22:J34,3))","v":0},1]
["Stabilizat",{"$f":"C15","v":0},{"$f":"INDEX(Tab!I38:I41,F15)","v":0},0,{"$f":"INDEX(Tab!J38:J41,F15)","v":0},1,null,null,{"$f":"\"Fire at \"&INDEX(Tab!K38:K41,F15)","v":"Fire at stationary"}]
[null,{"$f":"ROUND(SUM(B7:B15),3)","v":22.661999999999999},{"$f":"SUM(C7:C15)","v":43.118940375000001},{"$f":"ROUND(SUM(D7:D15),1)","v":0},{"$f":"CEILING(SUM(E7:E15),0.000001)","v":0.24867},null,null,null,{"$f":"IF(F9=2,4,0)*J7","v":0},"turns to set up for direct fire"]
[null,null,null,null,null,null,null,null,{"$f":"IF(F9=1,4,8)*J7","v":42},"turns to set up for indirect fire"]
[]
["Magazine","Vol (dm3)","Mass (kg)",null,"Price (Cr)",null,null,null,"ROF",{"$f":"IF(F8<4,1,FLOOR(40/J7*IF(F6=1,1,F6/2),1))","v":1},"rounds/turn"]
["Frame",{"$f":"C21/2","v":0},{"$f":"C21*0.01","v":0},null,{"$f":"C20*5","v":0},0,"rounds",null,"Reload",{"$f":"IF(F8<4,MAX(1,ROUND(J9*IF(OR(F8=2,F8=3),VLOOKUP(J6,Tab!E17:F21,2),1),0)),0)","v":205},"turns"]
["Ammo",0,{"$f":"F20*C4","v":0},null,0]
["Battery",null,null,null,null,null,null,null,"S Range",{"$f":"5*(J7+(J8/20)+20)","v":902.5},"m"]
[null,{"$f":"SUM(B20:B22)","v":0},{"$f":"SUM(C20:C22)","v":0},null,{"$f":"CEILING(SUM(E20:E22),1)","v":0},{"$f":"CEILING(C24*10,1)","v":0},"turns to change",null,null,{"$f":"J22*0.75","v":676.875},"m"]
[null,{"$f":"ROUND(B23/1000,3)","v":0},{"$f":"ROUND(C23/1000,3)","v":0},null,null,null,null,null,"Indirect",{"$f":"ROUND(SQRT(J7)*J8*0.0004,2)","v":3.89},"km"]
["Total",{"$f":"B16+B24","v":22.661999999999999},{"$f":"C16+C24","v":43.118940375000001}]
[null,null,null,null,null,null,null,null,"Gun Crew",{"$f":"IF(F8>2,1,IF(F9=1,MAX(2,CEILING(J7/6,1)),CEILING(J7/3,1)))","v":2},"direct fire"]
["Weapon Type:",null,{"$f":"\"TL-\"&J6&\" \"&J7*10&\"/L\"&J8&\" \"&IF(F6=1,\"\",F6&\"-barrel \")&\" \"&IF(J10=2,INDEX(Tab!N30:N34,F8)&\" \",\"\")&INDEX(Tab!N15:N17,J10)","v":{"$error":"#VALUE!"}},null,null,null,null,null,null,{"$f":"IF(F8>2,1,IF(F9=1,MAX(2,CEILING(J7/2,1)),J7))","v":6},"indirect fire"]
["Ammunition:",null,{"$f":"J7*10&\"x\"&J7*50&\" mm \"","v":"105x525 mm "}]
["Muzzle Energy:",null,{"$f":"ROUND(J9,3)&\" MJ\"","v":"204.57 MJ"}]
["Weapon Length:",null,{"$f":"D16&\" cm gun tube\"","v":"0 cm gun tube"}]
["Weapon Mass:",null,{"$f":"C16&\" ton \"&INDEX(Tab!L25:L27,F9)","v":"43.118940375 ton vehicle mount"}]
["Weapon Price:",null,{"$f":"E16&\" MCr\"","v":"0.24867 MCr"}]
["Magazine Mass:",null,{"$f":"C24&\" ton, (\"&F20&\" rounds), \"&F23&\" turns to change magazine\"","v":"0 ton, (0 rounds), 0 turns to change magazine"}]
["Magazine Price:",null,{"$f":"\"Cr \"&E23","v":"Cr 0"}]
["Gun Crew:",null,{"$f":"IF(F14=1,J26&\" for direct fire\",IF(J26=J27,J26&\" for direct or indirect fire\",J26&\" for direct fire, \"&J27&\" for indirect fire\"))&IF(I16>0,\", \"&I16&\" turns to set up for direct fire\",\"\")&IF(AND(F14=1,I17>0),\"\",\", \"&I17&\" turns to set up for indirect fire\")","v":"2 for direct fire"}]
["Volume:",null,{"$f":"B25&\" m3 (\"&B16&\" m3 gun, \"&B24&\" m3 magazine)\"","v":"22.662 m3 (22.662 m3 gun, 0 m3 magazine)"}]
["Features:",null,{"$f":"IF(F6=1,INDEX(Tab!N22:N23,F7)&\" barrel\",F6&\" \"&INDEX(Tab!N22:N23,F7)&\" barrels\")&\", \"&INDEX(Tab!N30:N34,F8)&\" action\"&IF(F9=2,\", carriage\",\"\")&IF(F10=2,\", gun shield\",\"\")&IF(F12=1,\"\",\", \"&INDEX(Tab!H3:H9,F12))&IF(F13=1,\"\",\", \"&INDEX(Tab!H14:H18,F13)&\" ballistic computer\")&IF(F14=1,\"\",\", indirect fire sight\")&IF(F15=1,\"\",\", \"&INDEX(Tab!H38:H41,F15)&\" stabilization\")","v":{"$error":"#VALUE!"}}]
["Notes:",null,{"$f":"\"Using small-arms damage formula, the KE damage value is \"&ROUND(1000*SQRT(J9)/15,0)&\". \"&IF(F12=1,\"\",\"Range finder ignores \"&J13&\" Diff Mods.\")","v":"Using small-arms damage formula, the KE damage value is 954. "}]
[]
[{"$f":"J7*10&\"/L\"&J8&\" \"&INDEX(Tab!N15:N17,J10)","v":{"$error":"#VALUE!"}},null,{"$f":"IF(J20=0,\"ROF\",\"Reload\")","v":"Reload"},"S Range","IFR"]
["Kinetic Penetrators",null,{"$f":"IF(J20=0,J19&\"/turn\",J20&\" turn\"&IF(J20=1,\"\",\"s\"))","v":"205 turns"},{"$f":"MIN(1000*J12,J22)","v":100},{"$f":"IF(F14=1,\"None\",J24)","v":"None"}]
["Non-kinetic warheads",null,{"$f":"C41","v":"205 turns"},{"$f":"MIN(1000*J12,J23)","v":100},{"$f":"E41","v":"None"}]
[]
["Kinetic Penetrators",null,"Damage Value",null,"Pen Val",null,"Mass (kg)","Price (Cr)",null,{"$f":"J45*1.15","v":940.69999999999993},"Short Pen"]
["KEAP (AP)",null,{"$f":"C46","v":"DV: 23 (954)"},null,{"$f":"ROUND(J44,0)&\"/\"&ROUND(J45,0)&\"/\"&ROUND(J46,0)&\"/\"&ROUND(J47,0)","v":"941/818/695/450"},null,{"$f":"J51*2","v":46},{"$f":"(J49*5+J52)*2","v":230},null,{"$f":"ROUND(MIN(J9*VLOOKUP(J9,Tab!H44:J52,2),VLOOKUP(J9,Tab!H44:J52,3)),0)","v":818},"Med Pen"]
[{"$f":"IF(J6<5,\"#Not Available\",\"HVAP\")","v":"HVAP"},null,{"$f":"\"DV: \"&ROUND(J7*2.2,0)&\" (\"&ROUND(1000*SQRT(J9)/15,0)&\")\"","v":"DV: 23 (954)"},null,{"$f":"ROUND(J44*1.3,0)&\"/\"&ROUND(J45*1.3,0)&\"/\"&ROUND(J46*1.3,0)&\"/\"&ROUND(J47*1.3,0)","v":"1223/1063/904/585"},null,{"$f":"J51*1.5","v":34.5},{"$f":"(J49*15+J52)*1.5","v":517.5},null,{"$f":"J45*0.85","v":695.3},"Long Pen"]
[{"$f":"IF(J6<6,\"#Not Available\",\"APDS\")","v":"APDS"},null,{"$f":"C46","v":"DV: 23 (954)"},null,{"$f":"ROUND(J44*1.7,0)&\"/\"&ROUND(J45*1.7,0)&\"/\"&ROUND(J46*1.7,0)&\"/\"&ROUND(J47*1.7,0)","v":"1599/1391/1182/765"},null,{"$f":"J51","v":23},{"$f":"J52+J49*15","v":345},null,{"$f":"J45*0.55","v":449.90000000000003},"Extreme Pen"]
[{"$f":"IF(J6<7,\"#Not Available\",\"APFSDS\")","v":"APFSDS"},null,{"$f":"C46","v":"DV: 23 (954)"},null,{"$f":"ROUND(J44*2.4,0)&\"/\"&ROUND(J45*2.4,0)&\"/\"&ROUND(J46*2.4,0)&\"/\"&ROUND(J47*2.4,0)","v":"2258/1963/1669/1080"},null,{"$f":"J51","v":23},{"$f":"J52+J49*15","v":345}]
[{"$f":"IF(J6<8,\"#Not Available\",\"APFSDSDU\")","v":"APFSDSDU"},null,{"$f":"C46","v":"DV: 23 (954)"},null,{"$f":"ROUND(J44*3,0)&\"/\"&ROUND(J45*3,0)&\"/\"&ROUND(J46*3,0)&\"/\"&ROUND(J47*3,0)","v":"2822/2454/2086/1350"},null,{"$f":"J51","v":23},{"$f":"J52+J49*30","v":690},null,{"$f":"(VLOOKUP(J7,Tab!A2:D31,4) + (VLOOKUP(J7+IF(J7>25,5,1),Tab!A2:D31,4)-VLOOKUP(J7,Tab!A2:D31,4))*(J7-FLOOR(J7,1)))","v":23},"Warhead Mass"]
[{"$f":"IF(J6<10,\"#Not Available\",\"APFSDSCI\")","v":"APFSDSCI"},null,{"$f":"C46","v":"DV: 23 (954)"},null,{"$f":"ROUND(J44*4.5,0)&\"/\"&ROUND(J45*4.5,0)&\"/\"&ROUND(J46*4.5,0)&\"/\"&ROUND(J47*4.5,0)","v":"4233/3681/3129/2025"},null,{"$f":"J51","v":23},{"$f":"J52+J49*35","v":805},null," "]
[{"$f":"IF(J6<12,\"#Not Available\",\"APFSDSSD\")","v":"APFSDSSD"},null,{"$f":"C46","v":"DV: 23 (954)"},null,{"$f":"ROUND(J44*5,0)&\"/\"&ROUND(J45*5,0)&\"/\"&ROUND(J46*5,0)&\"/\"&ROUND(J47*5,0)","v":"4704/4090/3477/2250"},null,{"$f":"J51","v":23},{"$f":"J52+J49*40","v":920},null,{"$f":"J49","v":23},"Total mass"]
[{"$f":"IF(J6<14,\"#Not Available\",\"APFSDSBSD\")","v":"#Not Available"},null,{"$f":"C46","v":"DV: 23 (954)"},null,{"$f":"ROUND(J44*6,0)&\"/\"&ROUND(J45*6,0)&\"/\"&ROUND(J46*6,0)&\"/\"&ROUND(J47*6,0)","v":"5644/4908/4172/2699"},null,{"$f":"J51","v":23},{"$f":"J52+J49*45","v":1035}]
[{"$f":"IF(J6<17,\"#Not Available\",\"APFSDSBCS\")","v":"#Not Available"},null,{"$f":"C46","v":"DV: 23 (954)"},null,{"$f":"ROUND(J44*7,0)&\"/\"&ROUND(J45*7,0)&\"/\"&ROUND(J46*7,0)&\"/\"&ROUND(J47*7,0)","v":"6585/5726/4867/3149"},null,{"$f":"J51","v":23},{"$f":"J52+J49*50","v":1150}]
[]
["Non-kinetic warheads",null,"Conc/Burst",null,"Pen Val",null,"Mass (kg)","Price (Cr)"]
["HE",null,{"$f":"\"C: \"&ROUND(VLOOKUP(J6,Tab!F44:G51,2)*J7^2,0)&\", B: \"&ROUND(SQRT(ROUND(VLOOKUP(J6,Tab!F44:G51,2)*J7^2,0))*IF(J10=3,10,7)/5,0)*5","v":"C: 28, B: 35"},null,{"$f":"IF(J7*1.5-7<0,\"Nil\",ROUND(J7*1.5-7,0)&\"C\")","v":"9C"},null,{"$f":"J51","v":23},{"$f":"J52+J49*10","v":230}]
["HEAP",null,{"$f":"\"C: \"&ROUND(VLOOKUP(J6,Tab!F44:G51,2)*J7^2*0.66,0)&\", B: \"&ROUND(SQRT(ROUND(VLOOKUP(J6,Tab!F44:G51,2)*J7^2,0))*0.66*IF(J10=3,10,7)/5,0)*5","v":"C: 18, B: 25"},null,{"$f":"IF(J7*VLOOKUP(J6,Tab!L44:M49,2)-7<0,\"Nil\",ROUND(J7*VLOOKUP(J6,Tab!L44:M49,2)-7,0)&\"C\")","v":"119C"},null,{"$f":"J51","v":23},{"$f":"J52+J49*15","v":345}]
["SEFOP",null,{"$f":"\"C: \"&ROUND(VLOOKUP(J6,Tab!F44:G51,2)*J7^2*0.5,0)&\", B: \"&ROUND(SQRT(ROUND(VLOOKUP(J6,Tab!F44:G51,2)*J7^2,0))*IF(J10=3,10,7)/5,0)*5","v":"C: 14, B: 35"},null,{"$f":"E57","v":"119C"},null,{"$f":"J51","v":23},{"$f":"J52+J49*20","v":460}]
["CHEM",null,{"$f":"\"C: \"&IF(J7<10,2,3)&\", B: \"&ROUND(0.2*J7^2/8,0)*5","v":"C: 3, B: 15"},null,"Nil",null,{"$f":"J51","v":23},{"$f":"J52+J49*10","v":230}]
["WP",null,{"$f":"\"C: \"&IF(J7<10,2,3)&\", B: \"&ROUND(0.2*J7*IF(J7<10,2,3),0)*5","v":"C: 3, B: 30"},null,"Nil",null,{"$f":"J51","v":23},{"$f":"J52+J49*20","v":460}]
["ILLUM",null,{"$f":"\"B: \"&ROUND(0.2*(J7*VLOOKUP(J6,Tab!H55:I59,2))^2,0)*5","v":"B: 1765"},null,"Nil",null,{"$f":"J51","v":23},{"$f":"J52+J49*10","v":230}]
["Submunition",null,{"$f":"\"B: \"&ROUND(0.2*0.25*J7^2,0)*5","v":"B: 30"},null,"As submunition",null,{"$f":"J51","v":23},{"$f":"J52+J49*60","v":1380}]
[{"$f":"IF(J6<9,\"#Not Available\",\"Homing Submunition\")","v":"Homing Submunition"},null,{"$f":"\"B: \"&ROUND(0.2*0.125*J7^2,0)*5","v":"B: 15"},null,"As submunition",null,{"$f":"J51","v":23},{"$f":"J52+J49*100","v":2300}]
["RDM",null,{"$f":"\"B: \"&ROUND(0.2*0.5*J7^2,0)*5","v":"B: 55"},null,"As mines",null,{"$f":"J51","v":23},{"$f":"J52+J49*100","v":2300}]
["Flechette",null,{"$f":"\"DS: \"&ROUND(0.02*J23,0)*5&\"x\"&ROUND(0.2*0.2*J23,0)*5","v":"DS: 70x135"},null,{"$f":"\"1-Nil\"","v":"1-Nil"},null,{"$f":"J51","v":23},{"$f":"J52+J49*50","v":1150}]
["Chaff",null,{"$f":"C61","v":"B: 1765"},null,"Nil",null,{"$f":"J51","v":23},{"$f":"J52+J49*20","v":460}]