{"text_format":"1","workbook":"xlsx","n_sheets":16,"sheets":["Manual","Tables","Ship","BL-BR Data","T4 Data","HTML","WTables","Laser","PAWS","Meson","Missile","Sheet1","sheet 2","Tab","CPRGun","Gauss"],"not_rendered":{"charts":0,"images":0,"macros":0,"external_links":1,"defined_names":2,"comments":0,"pivot_tables":0},"unopened":[],"bounds":{"document_bytes":16777216,"sheet_cells":100000,"rows_first":2000,"rows_last":500,"rows_between":2000,"halvings":0,"cell_chars":16384,"cell_head_chars":4096},"cells_cut":0,"cells_raw":0,"read":"whole","date_system":"1900"}

{"sheet":"Manual","index":0,"n_rows":142,"n_cols":2,"rows_kept":142,"cut":false,"hidden":false,"merged":[]}
["This text contains instructions how to use the \"BR-98R4\" Traveller starship design spreadsheet."]
[]
["0. Basics"]
[null,"All numbers shown on bold font are intended for user input."]
[]
[null,"When the instructions prompts you to \"enter\" a value, you"]
[null,"should type the new value over a existing bolded value."]
[]
[null,"When the instructions prompts you to \"select\" an equipment, you "]
[null,"should open a pull-down menu, and select a item."]
{"$rows_left_out":133}
{"sheet":"Tables","index":1,"n_rows":404,"n_cols":34,"rows_kept":404,"cut":false,"hidden":false,"merged":[]}
["0: Spacecraft hull",null,null,null,null,null,null,null,null,null,null,null,null,null,"Cutter",null,"Unstreamlined","USL"]
[{"$f":"14*Ship!B2","v":67.2},"m3","Ratio","Radius (m)","Area (m2)","Surf Mod","Length","Width","Height","Ref Area","Unstreamlined","Streamlined","Airframed",null,"Gunboat",null,"Streamlined","SL",null,"Size","Rate","Vol","MV",null,"Location","Slope","Armor Mult.","Volume consumed"]
["Sphere",null,null,{"$f":"(A2/(4/3*PI()))^(1/3)","v":2.5220879155938243},{"$f":"4*PI()*D3^2","v":79.933771837820089},1,{"$f":"2*D3","v":5.0441758311876486},{"$f":"G3","v":5.0441758311876486},{"$f":"G3","v":5.0441758311876486},{"$f":"PI()*D3^2","v":19.983442959455022},0.8,0.1,"#Not Available",null,"Monitor",null,"Airframed","AF",null,null,1,14,0.6,null,"Fron/Rear","No Slope",1,0]
[{"$f":"\"Flat-ended Cylinder (\"&C4&\":1)\"","v":"Flat-ended Cylinder (1:1)"},null,1,{"$f":"(A2/(2*PI()*C4))^(1/3)","v":2.2032467334102561},{"$f":"2*PI()*D4^2*(1+2*C4)","v":91.501327083761055},{"$f":"E4/E3","v":1.1447142425533317},{"$f":"2*D4*C4","v":4.4064934668205122},{"$f":"2*D4","v":4.4064934668205122},{"$f":"H4","v":4.4064934668205122},15.250221180626843,0.6,0.8,"#Not Available",null,"Courier",null,null,null,null,null,2,28,0.7,null,"Front/Rear","Moderate Slope",1.5,0.1]
[{"$f":"\"Rounded Cylinder 1 (\"&C5&\":1)\"","v":"Rounded Cylinder 1 (2:1)"},null,2,{"$f":"(A2/(2*PI()*(C5-1/6)))^(1/3)","v":1.8001802387291379},{"$f":"PI()*D5^2*(1+4*C5)","v":91.627188765220566},{"$f":"E5/E3","v":1.1462888170862946},{"$f":"2*D5*C5","v":7.2007209549165516},{"$f":"2*D5","v":3.6003604774582758},{"$f":"H5","v":3.6003604774582758},10.180798751691174,0.7,0.8,1.2,null,"Scout",null,null,null,null,null,3,42,1,null,"Front/Rear","Radical Slope",2,0.2]
[{"$f":"\"Rounded Cylinder 2 (\"&C6&\":1)\"","v":"Rounded Cylinder 2 (4:1)"},null,4,{"$f":"(A2/(2*PI()*(C6-1/3)))^(1/3)","v":1.4288040023454989},{"$f":"4*PI()*D6^2*C6","v":102.61602121599326},{"$f":"E6/E3","v":1.2837630310276591},{"$f":"2*D6*C6","v":11.430432018763991},{"$f":"2*D6","v":2.8576080046909977},{"$f":"H6","v":2.8576080046909977},6.4135013259995786,0.7,0.8,1.2,null,"Close Escort",null,"FFS1 Int. strukt.",null,null,null,4,56,1.3,null,"Sides","No Slope",1,0]
[{"$f":"\"Needle (\"&B7&\":\"&C7&\":1)\"","v":"Needle (2:2:1)"},2,2,{"$f":"(A2/(2*PI()*(B7+C7/3)))^(1/3)","v":1.5888158272710715},{"$f":"PI()*D7^2*(1+4*B7+(1+4*C7^2)^0.5)","v":104.07193083341026},{"$f":"E7/E3","v":1.3019769796997041},{"$f":"2*D7*(B7+C7)","v":12.710526618168572},{"$f":"2*D7","v":3.177631654542143},{"$f":"H7","v":3.177631654542143},7.9304345939463508,0.7,0.8,1.2,null,"Escort",null,"FFS2 Struct. factor",null,null,null,5,70,1.5,null,"Sides","Moderate Slope",1.5,0.2]
[{"$f":"\"Cone (\"&C8&\":1)\"","v":"Cone (3.7:1)"},null,3.7,{"$f":"(A2/(2/3*PI()*C8))^(1/3)","v":2.0544850173488354},{"$f":"PI()*D8^2*(1+SQRT(1+4*C8^2))","v":112.27907387079617},{"$f":"E8/E3","v":1.4046512667837368},{"$f":"2*D8*C8","v":15.203189128381382},{"$f":"2*D8","v":4.1089700346976707},{"$f":"H8","v":4.1089700346976707},13.260375721015812,0.8,0.9,1.1000000000000001,null,"Destroyer",null,"Asteroid hull",null,null,null,6,84,1.8,null,"Sides","Radical Slope",2,0.4]
[{"$f":"\"Disc (\"&C9&\":1)\"","v":"Disc (2:1)"},null,2,{"$f":"(A2*C9/(2*PI()))^(1/3)","v":2.7759169375356993},{"$f":"2*PI()*D9^2*(1+2/C9)","v":96.832868579499049},{"$f":"E9/E3","v":1.2114137285547593},{"$f":"2*D9","v":5.5518338750713987},{"$f":"G9","v":5.5518338750713987},{"$f":"D9/C9","v":1.3879584687678497},{"$f":"H9*I9","v":7.7057148440975753},1.4,1.6,1.2,null,"Frigate",null,null,null,null,null,7,98,2]
[{"$f":"\"Torus (\"&C10&\":1)\"","v":"Torus (8:1)"},null,8,{"$f":"(A2/(2*PI()^2*C10))^(1/3)","v":0.75217087849590603},{"$f":"4*PI()^2*C10*D10^2","v":178.68280179731994},{"$f":"E10/E3","v":2.2353855909596581},{"$f":"(C10+1)*D10","v":6.769537906463154},{"$f":"G10","v":6.769537906463154},{"$f":"2*D10","v":1.5043417569918121},{"$f":"(C10+PI())*D10^2","v":6.3034789406304776},0.6,0.8,1.2,null,"Cruiser",null,null,null,null,null,8,112,2.2000000000000002]
{"$rows_left_out":395}
{"sheet":"Ship","index":2,"n_rows":166,"n_cols":17,"rows_kept":166,"cut":false,"hidden":false,"merged":[]}
["Tech Level",{"$f":"IF(K143=K144,K143,K143&\"/\"&K144)","v":"8/14"},null,null,null,null,null,null,null,null,null,{"$f":"ROUND((B2*7)^(1/3)*2.1,2)","v":6.78},"m length",{"$f":"140*B2*F5*I20","v":0},"kN"]
["Hull Size",4.8,"TD"," ","Name","M1A5",null,null,null,null,null,{"$f":"ROUND((B2*7)^(1/3),2)","v":3.23},"m width",{"$f":"140*B2*F5*I21","v":0},"kN"]
["Hull Shape",25,null," ","Type",24,null,null,{"$f":"INDEX(Tables!$V$3:$V$13,B2)","v":56},null,null,{"$f":"ROUND((B2*7)^(1/3)*IF(B5<2,0.7,0.9),2)","v":2.9},"m height"]
["Streamline",1,null,null,"Duration",1,null,null,null,null,null,null,2]
["Config",3,null,null,"Density",1,"ton/m3"]
[null,null,null,null,null,{"$f":"ROUND(C150/(14*B2),4)","v":0.93189999999999995},"ton/m3 actual density",null,null," ",null,{"$f":"SUM(C9:C17)","v":42.906133333333337},"tons armor"]
[]
["Hull","Vol (m3)","Mass (ton)","Pow (MW)","Area (m2)","Price (MCr)"]
["Hull Shell",{"$f":"Tables!$W$13*L9*IF(I9=0,0,1)","v":0},{"$f":"B9*INDEX(Tables!$D$30:$D$51,$G$9)","v":0},{"$f":"B9*INDEX(Tables!$E$30:$E$51,$G$9)","v":0},{"$f":"INDEX(Tables!E3:E27,B3)*IF(B4=3,1.3,1)","v":0},{"$f":"C9*INDEX(Tables!$F$30:$F$51,$G$9)","v":0},13,null,0,null,null,{"$f":"I9/INDEX(Tables!$C$30:$C$51,$G$9)","v":0},"cm base armor thickness"]
["Front",{"$f":"Tables!$W$13*L10*IF(I10=0,0,1)*0.1","v":2.5988000000000002},{"$f":"B10*INDEX(Tables!$D$30:$D$51,$G$9)","v":20.790400000000002},{"$f":"B10*INDEX(Tables!$E$30:$E$51,$G$9)","v":0},null,{"$f":"C10*INDEX(Tables!$F$30:$F$51,$G$9)","v":0.1663232}," ",null,{"$f":"((0.33*160)+(0.67*240))/2","v":106.80000000000001}," ",null,{"$f":"I10/INDEX(Tables!$C$30:$C$51,$G$9)","v":17.8},"cm additional armor thickness"]
{"$rows_left_out":157}
{"sheet":"BL-BR Data","index":3,"n_rows":69,"n_cols":11,"rows_kept":69,"cut":false,"hidden":false,"merged":[]}
["General Data"]
[{"$f":"\"Displacement: \"&Ship!B2&IF(Ship!B148>0,\"/\"&Ship!B2+ROUND(Ship!B148/14,0),\"\")&\" tons\"","v":"Displacement: 4.8 tons"},null,null,null,{"$f":"\"Hull Armor: \"&Ship!I9","v":"Hull Armor: 0"}]
[{"$f":"\"Length: \"&Ship!L1&\" meters\"","v":"Length: 6.78 meters"},null,null,null,{"$f":"\"Volume: \"&Ship!B2*14&IF(Ship!B148>0,\"/\"&ROUND(Ship!B2*14+Ship!B148,0),\"\")&\" m3\"","v":"Volume: 67.2 m3"}]
[{"$f":"\"Price: MCr \"&ROUND(Ship!F143,1)","v":"Price: MCr 0.7"},null,null,null,{"$f":"\"Target Size: \"&SizeCode(Ship!B2)","v":{"$error":"#NAME?"}}]
[{"$f":"\"Configuration: \"&INDEX(Tables!Q1:Q3,Ship!B4)&\" \"&INDEX(Tables!A3:A22,Ship!B3)","v":{"$error":"#REF!"}},null,null,null,{"$f":"\"Tech Level: \"&IF(Ship!K143=Ship!K144,Ship!K143,Ship!K143&\"/\"&Ship!K144)","v":"Tech Level: 8/14"}]
[{"$f":"\"Mass (Loaded/Empty): \"&ROUND(Ship!C150,1)&\" / \"&ROUND(Ship!C150-(Ship!C141+Ship!C122+Ship!C91),1)&IF(Ship!C148=0,\"\",\" with external systems, \"&ROUND(Ship!C143,1)&\" / \"&ROUND(Ship!C143-(Ship!C141+Ship!C91),1)&\" without external systems\")","v":"Mass (Loaded/Empty): 62.6 / 62.4"}]
[]
["Engineering Data"]
[{"$f":"Ship!M25","v":"Power Plant: 1.4 MW N/A Power Plant, 12 hour duration (3.4 m3 fuel)"}]
[{"$f":"CHOOSE(Ship!G13,\"\",\"Jump Performance: \",\"Jump Performance: \",\"Warp Efficiency: \",\"Subspace Velocity: \")&Ship!F1&CHOOSE(Ship!G13,\"\",\" (\"&Ship!B16&\" m3 fuel)\",\" (\"&Ship!B16&\" m3 fuel)\",\" (\"&Ship!I13&\" MW)\",\" Parsec/hour (\"&Ship!I13&\" MW)\")","v":""}]
{"$rows_left_out":60}
{"sheet":"T4 Data","index":4,"n_rows":39,"n_cols":7,"rows_kept":39,"cut":false,"hidden":false,"merged":[]}
["T4 Starship Data"]
["Ship or Class Name and Type"]
[]
[{"$f":"\"Tons: \"&Ship!B2&\" (\"&INDEX(Tables!A3:A22,Ship!B3)&\" \"&INDEX(Tables!R1:R3,Ship!B4)&\")\"","v":{"$error":"#REF!"}},null,null,{"$f":"\"Volume: \"&14*Ship!B2&\" m3\"","v":"Volume: 67.2 m3"},null,null,{"$f":"\"Cost: \"&ROUND(Ship!F143,3)&\" MCr\"","v":"Cost: 0.68 MCr"}]
[{"$f":"\"Crew: \"&Ship!I140","v":"Crew: "},null,null,{"$f":"\"High/Mid Pass: \"&Ship!I106+Ship!I107","v":"High/Mid Pass: 0"},null,null,{"$f":"\"Low Pass: \"&Ship!G105","v":"Low Pass: Low passengers"}]
[{"$f":"\"Cargo: \"&Ship!G91&\" tons\"","v":"Cargo: 0 tons"},null,null,{"$f":"\"Controls: \"&IF(Ship!G32=1,\"Std\",\"Fib\")&IF(Ship!I109>0,\"(Bridge)\",\"\")","v":"Controls: Std"},null,null,{"$f":"\"TL: \"&Ship!K143&\"/\"&Ship!K144","v":"TL: 8/14"}]
[]
[{"$f":"FLOOR(LOG(Ship!B2),1)+6&\" Size\"","v":"6 Size"},null,null,{"$f":"IF(Ship!F1=\"\",\"0 Jump drive\",Ship!F1&\" Jump Drive (\"&ROUND((Ship!B16/14)/Ship!F1,1)&\" tons/Pc Fuel)\")","v":"0 Jump drive"}]
[{"$f":"IF(Ship!I72>0,Ship!G73,0)&\" Fire Control\"","v":"0 Fire Control"},null,null,{"$f":"Ship!I20&\" Maneuver (\"&INDEX(Tables!B287:B294,Ship!G20)&\", \"&Ship!D20&\" MW)\"&IF(AND(G20=1,Ship!G21=1),\", No ASD\",\"\")","v":"0 Maneuver (None, 0 MW)"}]
[null,null,null,{"$f":"ROUND(Ship!D25*2/Ship!B2,1)&\" Power Plant (\"&Ship!D25&\" MW)\"","v":"0.6 Power Plant (1.4 MW)"}]
{"$rows_left_out":30}
{"sheet":"HTML","index":5,"n_rows":100,"n_cols":1,"rows_kept":100,"cut":false,"hidden":false,"merged":[]}
["<HTML><HEAD><TITLE>"]
[{"$f":"Ship!F2&\"-Class \"&INDEX(Tables!O1:O27,Ship!F3)","v":"M1A5-Class Troop Transport"}]
["</TITLE></HEAD>"]
["<BODY BGCOLOR=\"DDDDDD\" TEXT=\"111111\" LINK=\"0000AA\" VLINK=\"440000\">"]
["<CENTER>"]
["<IMG SRC=\"../../graphics/bardicon.gif\" HEIGHT=75 WIDTH=75 ALIGN=LEFT ALT=\"BARD Icon\">"]
["<IMG SRC=\"../../graphics/bardicon.gif\" HEIGHT=75 WIDTH=75 ALIGN=RIGHT ALT=\"BARD Icon\">"]
["<TT>BARD PAPER: SARA5xxx</TT> <P>"]
["| <A HREF=\"../../roberts.html\"> Home </A> "]
["| <A HREF=\"../../traveller.html\"> Traveller </A> "]
{"$rows_left_out":91}
{"sheet":"WTables","index":6,"n_rows":171,"n_cols":15,"rows_kept":171,"cut":false,"hidden":false,"merged":[]}
["Name","Displac","Lenght (m)","Width (m)","Area (m2)","Price","Type","ROF","Diff Mod","Vol Mod","FA Mult"]
["turret",3,4.2,3.6,10,0.09,"C-PAW",10,0,1,1,"T"]
["barbette",6,5.25,4.5,16,0.1,"N-PAW",50,1,1,1,"B"]
["small bay",50,{"$f":"ROUND(1.4*(B4*14)^(1/3),0)","v":12},{"$f":"5*ROUND(SQRT(B4*14/C4)/5,1)","v":7.5},{"$f":"C4*D4","v":90},"manned","tunable",100,2,1,1,"S"]
["large bay",100,{"$f":"ROUND(1.4*(B5*14)^(1/3),0)","v":16},{"$f":"5*ROUND(SQRT(B5*14/C5)/5,1)","v":9.5},{"$f":"C5*D5","v":152},"remote","x-ray",200,3,1.3,2,"L"]
["custom bay",200,{"$f":"ROUND(1.4*(B6*14)^(1/3),0)","v":20},{"$f":"5*ROUND(SQRT(B6*14/C6)/5,1)","v":12},{"$f":"C6*D6","v":240},"M","gravitic focus",400,4,1.7,4,"C"]
["spinal","Unlimited","Unlimited","Unlimited","Unlimited","R","non-gravitic",800,5,2.2000000000000002,8,"X"]
[]
["Tech Level","Len Mult","C-PAW","N-PAW","Mass Mult","HPG","Beam Poi","Contr Mult","Workstat","Len Mult","Vol Mult","Mass Mult"]
[8,0.12,1,0,1.2,0.125,3,0.6,7.5000000000000002E-4,"N/A","N/A","N/A"]
{"$rows_left_out":162}
{"sheet":"Laser","index":7,"n_rows":37,"n_cols":11,"rows_kept":37,"cut":false,"hidden":false,"merged":[]}
["Tech Level",12]
["Mount",1,null,null,"Diameter",2,"m",{"$f":"IF(F2>H8,\"Error: \",\"\")&H8&\" m max diameter\"","v":"3.6 m max diameter"}]
["Type",2,null,{"$f":"IF(AND(B3=2,VLOOKUP(B1,WTables!A38:J54,10)=\"N/A\"),\"Error: N/A\",\"\")","v":"Error: N/A"},"Energy",200,"MJ",{"$f":"IF(F3>50*B1,\"Error: \",\"\")&50*B1&\" MJ max pulse\"","v":"600 MJ max pulse"}]
["Focusing",2,null,null,"Rate of fire",6,"shots/30 min"]
["Environ",1,null,null,"Crew",1,null,null,7]
[null,null,null,null,null,null,null,null,{"$f":"I5^2","v":49}]
[null,"Vol (m3)","Mass (ton)","Pow (MW)","Area (m2)","Price (MCr)","Lenght","Width"]
[{"$f":"INDEX(WTables!A2:A7,B2)","v":"turret"},{"$f":"IF(B2=6,\"Unlimited\",INDEX(WTables!B2:B7,B2)*14)","v":42},0,0,{"$f":"INDEX(WTables!E2:E7,B2)","v":10},0,{"$f":"INDEX(WTables!C2:C7,B2)","v":4.2},{"$f":"INDEX(WTables!D2:D7,B2)","v":3.6}]
[]
[null,"Vol (m3)","Mass (ton)","Pow (MW)","Area (m2)","Price (MCr)"]
{"$rows_left_out":28}
{"sheet":"PAWS","index":8,"n_rows":28,"n_cols":11,"rows_kept":28,"cut":false,"hidden":false,"merged":[]}
["Tech Level",14,null,null,"Lenght",60,"m",{"$f":"IF(F1>G8,\"Error: \",\"\")&G8&\" m max lenght\"","v":"Unlimited m max lenght"}]
["Mount",6,null,null,"Diameter",3.5682999999999998,"m",{"$f":"IF(F2>F1/8,\"Error: \",\"\")&F1/8&\" m max diamater\"","v":"7.5 m max diamater"}]
["Type",2,null,null,"Energy",3600,"MJ",{"$f":"IF(F3>F1^2,\"Error: \",\"\")&F1^2&\" MJ max pulse\"","v":"3600 MJ max pulse"}]
["Environ",1,null,null,"Rate of fire",3,"shots/30 min"]
[]
[]
[null,"Vol (m3)","Mass (ton)","Pow (MW)","Area (m2)","Price (MCr)","Lenght","Width"]
[{"$f":"INDEX(WTables!A2:A7,B2)","v":"spinal"},{"$f":"IF(B2=6,\"Unlimited\",INDEX(WTables!B2:B7,B2)*14)","v":"Unlimited"},0,0,{"$f":"INDEX(WTables!E2:E7,B2)","v":"Unlimited"},0,{"$f":"INDEX(WTables!C2:C7,B2)","v":"Unlimited"},{"$f":"INDEX(WTables!D2:D7,B2)","v":"Unlimited"}]
[]
[null,"Vol (m3)","Mass (ton)","Pow (MW)","Area (m2)","Price (MCr)",null,null,null,{"$f":"2*SQRT(6/PI())","v":2.763953195770684}]
{"$rows_left_out":19}
{"sheet":"Meson","index":9,"n_rows":28,"n_cols":11,"rows_kept":28,"cut":false,"hidden":false,"merged":[]}
["Tech Level",14,null,null,"Lenght",250,"m",{"$f":"IF(F1>G8,\"Error: \",\"\")&G8&\" m max lenght\"","v":"Unlimited m max lenght"}]
["Mount",6,null,null,"Diameter",{"$f":"ROUND(2*SQRT(E11/PI()),1)","v":5.6},"m"]
[null,null,null,null,"Energy",2500,"MJ"]
[null,null,null,null,"Rate of fire",3,"shots/30 min"]
[]
[]
[null,"Vol (m3)","Mass (ton)","Pow (MW)","Area (m2)","Price (MCr)","Lenght","Width"]
[{"$f":"INDEX(WTables!A2:A7,B2)","v":"spinal"},{"$f":"IF(B2=6,\"Unlimited\",INDEX(WTables!B2:B7,B2)*14)","v":"Unlimited"},0,0,{"$f":"INDEX(WTables!E2:E7,B2)","v":"Unlimited"},0,{"$f":"INDEX(WTables!C2:C7,B2)","v":"Unlimited"},{"$f":"INDEX(WTables!D2:D7,B2)","v":"Unlimited"}]
[]
[null,"Vol (m3)","Mass (ton)","Pow (MW)","Area (m2)","Price (MCr)"]
{"$rows_left_out":19}
{"sheet":"Missile","index":10,"n_rows":50,"n_cols":9,"rows_kept":50,"cut":false,"hidden":false,"merged":[]}
["Tech Level",14]
["Mount",1]
[]
[null,"Vol (m3)","Mass (ton)","Pow (MW)","Area (m2)","Price (MCr)"]
["X-ray nuke",{"$f":"VLOOKUP(B1,WTables!A101:H107,G5+1)","v":0},{"$f":"B5","v":0},null,null,{"$f":"INDEX(WTables!J101:J107,G5)","v":0},1]
["AHEAD",{"$f":"C6/5-0.0532","v":6.2E-2},0.57599999999999996,null,null,{"$f":"C6*0.05","v":2.8799999999999999E-2}]
["Las Comm",{"$f":"VLOOKUP(B1,Tables!A116:I123,H7+1)","v":2.8000000000000001E-2},{"$f":"2*B7","v":5.6000000000000001E-2},{"$f":"INDEX(Tables!B125:I125,H7)","v":0.15},{"$f":"IF(H7=1,0,1)","v":1},{"$f":"INDEX(Tables!B124:I124,H7)","v":5.6000000000000001E-2},null,7,"hex range"]
["LIDAR",{"$f":"VLOOKUP(B1,Tables!R181:U187,3)*E8","v":0},{"$f":"2*B8","v":0},{"$f":"E8","v":0},{"$f":"H8/VLOOKUP(B1,Tables!R181:U187,2)","v":0},{"$f":"5*E8","v":0},null,0,"hex range"]
["HEPlaR",0.2,{"$f":"B9","v":0.2},{"$f":"10*B9","v":2},{"$f":"B9","v":0.2},{"$f":"0.01*B9","v":2E-3},null,{"$f":"2000*B9","v":400},"kN thrust"]
["Fuel",{"$f":"0.00125*H9*H10","v":0.25},{"$f":"0.07*B10","v":1.7500000000000002E-2},null,null,null,null,0.5,"h"]
{"$rows_left_out":41}
{"sheet":"Sheet1","index":11,"n_rows":0,"n_cols":0,"rows_kept":0,"cut":false,"hidden":false,"merged":[]}

{"sheet":"sheet 2","index":12,"n_rows":171,"n_cols":15,"rows_kept":171,"cut":false,"hidden":false,"merged":[]}
["Name","Displac","Lenght (m)","Width (m)","Area (m2)","Price","Type","ROF","Diff Mod","Vol Mod","FA Mult"]
["turret",3,4.2,3.6,10,0.09,"C-PAW",10,0,1,1,"T"]
["barbette",6,5.25,4.5,16,0.1,"N-PAW",50,1,1,1,"B"]
["small bay",50,{"$f":"ROUND(1.4*(B4*14)^(1/3),0)","v":12},{"$f":"5*ROUND(SQRT(B4*14/C4)/5,1)","v":7.5},{"$f":"C4*D4","v":90},"manned","tunable",100,2,1,1,"S"]
["large bay",100,{"$f":"ROUND(1.4*(B5*14)^(1/3),0)","v":16},{"$f":"5*ROUND(SQRT(B5*14/C5)/5,1)","v":9.5},{"$f":"C5*D5","v":152},"remote","x-ray",200,3,1.3,2,"L"]
["custom bay",200,{"$f":"ROUND(1.4*(B6*14)^(1/3),0)","v":20},{"$f":"5*ROUND(SQRT(B6*14/C6)/5,1)","v":12},{"$f":"C6*D6","v":240},"M","gravitic focus",400,4,1.7,4,"C"]
["spinal","Unlimited","Unlimited","Unlimited","Unlimited","R","non-gravitic",800,5,2.2000000000000002,8,"X"]
[]
["Tech Level","Len Mult","C-PAW","N-PAW","Mass Mult","HPG","Beam Poi","Contr Mult","Workstat","Len Mult","Vol Mult","Mass Mult"]
[8,0.12,1,0,1.2,0.125,3,0.6,7.5000000000000002E-4,"N/A","N/A","N/A"]
{"$rows_left_out":162}
{"sheet":"Tab","index":13,"n_rows":86,"n_cols":17,"rows_kept":86,"cut":false,"hidden":false,"merged":[]}
["Bore (cm)","Mass (ton)","Energy (MJ)","Mass (kg)","Tech Level","ME Mult.",null,"Sights and Rangefinders",null,null,null,null,0,"#Not Available",0,0,0]
[0,0,0,0,0,0,null,{"$f":"CPRGun!J6","v":8},"Range","Mass (ton)","Price (MCr)",null,6,"analog",0.01,2E-3,1]
[2,0.1,0.06,0.2,4,0.8,null,"none",0.1,0,0,null,0,"#Not Available",0,0,0]
[3,0.12,0.15,0.4,5,1,null,"iron sight",0.2,5.0000000000000001E-3,2.5000000000000001E-4,null,8,"digital",0.02,5.0000000000000001E-3,2]
[4,0.16,0.35,0.8,7,1.2,null,{"$f":"IF(H2<5,\"#Not Available\",\"telescopic sight\")","v":"telescopic sight"},0.4,0.01,5.0000000000000001E-4,null,10,"digital",0.04,0.02,3]
[5,0.3,0.8,1.5,8,1.4,null,{"$f":"IF(H2<6,\"#Not Available\",\"optic rangefinder\")","v":"optic rangefinder"},0.6,0.02,1E-3,null,12,"digital",0.04,0.1,4]
[6,0.42,1.6,3,9,1.6,null,{"$f":"IF(H2<7,\"#Not Available\",\"laser rangefinder\")","v":"laser rangefinder"},0.8,0.04,5.0000000000000001E-3,null,0,"#Not Available",0,0,0]
[7,0.54,2.4,6,null,null,null,{"$f":"IF(H2<8,\"#Not Available\",\"imaging radar\")","v":"imaging radar"},1.6,0.06,0.01,null,14,"synaptic",0.03,0.5,5]
[8,0.6,3.6,12,null,null,null,{"$f":"IF(H2<10,\"#Not Available\",\"EMS rangefinder\")","v":"#Not Available"},3,0.08,0.02,null,16,"synaptic",0.02,1,6]
[9,1,4.9000000000000004,17,"Smoothbore range",null,null,null,null,null,null,null,0,"#Not Available",0,0,0]
{"$rows_left_out":77}
{"sheet":"CPRGun","index":14,"n_rows":66,"n_cols":11,"rows_kept":66,"cut":false,"hidden":false,"merged":[]}
["Ammo","Vol (dm3)","Mass (kg)",null,"Price (Cr)"]
["Warhead",{"$f":"C2/5","v":6},{"$f":"(VLOOKUP(J7,Tab!A2:D31,4) + (VLOOKUP(J7+IF(J7>25,5,1),Tab!A2:D31,4)-VLOOKUP(J7,Tab!A2:D31,4))*(J7-FLOOR(J7,1))) * INDEX(Tab!B34:B53,F2)","v":30},null,{"$f":"C2*INDEX(Tab!D34:D53,F2)","v":300},1]
["Propellant",{"$f":"C3/5","v":2.1},{"$f":"0.007*C2*J8 + IF(F3=2,1,0)*C2","v":10.5},null,{"$f":"5*C3 * IF(F3=1,1,2)","v":52.5},1]
[null,{"$f":"SUM(B2:B3)","v":8.1},{"$f":"SUM(C2:C3)","v":40.5},null,{"$f":"ROUND(SUM(E2:E3),2)","v":352.5}]
[]
["Weapon","Vol (m3)","Mass (ton)","Len (cm)","Price (MCr)",1,{"$f":"IF(AND(F6>1,J10<>2),\"Error: single barrel only\",\"barrel\"&IF(F6=1,\"\",\"s\"))","v":"barrel"},null,"Tech Level",8]
["Gun Tube",{"$f":"C7","v":1.8900000000000001},{"$f":"IF(J10=3,J7*D7*0.02/1000,(VLOOKUP(J7,Tab!A3:C30,2) + (VLOOKUP(J7+IF(J7>25,5,1),Tab!A3:C30,2)-VLOOKUP(J7,Tab!A3:C30,2))*(J7-FLOOR(J7,1))) * (1+(J8-60)*0.01) * (1+(F6-1)*0.3))","v":1.8900000000000001},{"$f":"J7*J8","v":600},{"$f":"C7*0.02","v":3.78E-2},2,null,null,"Bore Size",12,{"$f":"IF(AND(J10=2,J7>2+(J6-4)*2),2+(J6-4)*2&\" cm max\",\"cm\")","v":"cm"}]
["Loader",{"$f":"C8","v":0},{"$f":"((VLOOKUP(J7,Tab!A3:C30,2) + (VLOOKUP(J7+IF(J7>25,5,1),Tab!A3:C30,2)-VLOOKUP(J7,Tab!A3:C30,2))*(J7-FLOOR(J7,1))) * (1+(J8-60)*0.01)) * CHOOSE(F8,0,0.1,0,1,0.3) + IF(F8=3,C4*30/1000,0)","v":0},0,{"$f":"C8*CHOOSE(F8,1,0.01,0.01,0.003,0.01)","v":0},1,null,null,"Length",50,{"$f":"IF(J8>CHOOSE(J10,100,100,20),CHOOSE(J10,100,100,20)&\" calibers max\",\"calibers\")","v":"calibers"}]
["Carriage",{"$f":"C9","v":0},{"$f":"IF(J10=3,C7*CHOOSE(F9,0,2,1.6),IF(F9=1,0,MAX(C7,J9/2,IF(F8>3,J9*J19/4,0))))","v":0},0,{"$f":"C9*0.002","v":0},1,null,null,"Muzzle E",{"$f":"(VLOOKUP(J7,Tab!A3:C30,3) + (VLOOKUP(J7+IF(J7>25,5,1),Tab!A3:C30,3)-VLOOKUP(J7,Tab!A3:C30,3))*(J7-FLOOR(J7,1))) * (1+IF(J8>60,(J8-60)*0.01,0)-IF(J8<60,(IF(J8<20,0.8,(60-J8)*0.02) + IF(J8<20,(20-J8)*0.01,0)),0)) * IF(J11=2,2.5,VLOOKUP(J6,Tab!E2:F7,2))","v":10.416},"MJ"]
["Shield",{"$f":"C10","v":0},{"$f":"IF(F10=1,0,J7*0.07)","v":0},0,{"$f":"C10*0.001","v":0},1,null,null,"Type",1]
{"$rows_left_out":57}
{"sheet":"Gauss","index":15,"n_rows":66,"n_cols":14,"rows_kept":66,"cut":false,"hidden":false,"merged":[]}
["Ammo","Vol (dm3)","Mass (kg)",null,"Price (Cr)"]
["Warhead",{"$f":"C2/5","v":9.0919867500000002},{"$f":"(((J7/2)*(J7/2)*(J7/2)*3.1416)/10)","v":45.459933749999998},null,{"$f":"C2*INDEX(Tab!D34:D53,F2)","v":227.29966875},2]
["Propellant",null,null,null,{"$f":"5*C3 * IF(F3=1,1,2)","v":0}]
[null,{"$f":"SUM(B2:B3)","v":9.0919867500000002},{"$f":"SUM(C2:C3)","v":45.459933749999998},null,{"$f":"ROUND(SUM(E2:E3),2)","v":227.3}]
[]
["Weapon","Vol (m3)","Mass (ton)","Len (cm)","Price (MCr)",1,{"$f":"IF(AND(F6>1,J10<>2),\"Error: single barrel only\",\"barrel\"&IF(F6=1,\"\",\"s\"))","v":"barrel"},null,"Tech Level",12,{"$f":"IF(J6<8,\"Error: Minumum tech level 8\",\" \")","v":" "}]
["Gun",{"$f":"C7","v":2.2050000000000001},{"$f":"J7*J7/50","v":2.2050000000000001},0,{"$f":"C7*0.02","v":4.41E-2},null,null,null,"Bore Size",10.5,{"$f":"IF(AND(J10=2,J7>2+(J6-4)*2),2+(J6-4)*2&\" cm max\",\"cm\")","v":"cm"}]
["Loader",{"$f":"C8","v":0},{"$f":"IF(F8=1,0,IF(F8=2,30*C2/1000,50*C2/1000))","v":0},0,{"$f":"C8*CHOOSE(F8,1,0.01,0.01,0.003,0.01)","v":0},1,null,null,"Muzzle V",3000,"meters/second",null,{"$f":"IF(J6>11,6000,((J6-5)*1000))","v":6000},"m/s max. velocity"]
["Carriage",{"$f":"C9","v":0},{"$f":"IF(J10=3,C7*CHOOSE(F9,0,2,1.6),IF(F9=1,0,MAX(C7,J9/2,IF(F8>3,J9*J19/4,0))))","v":0},0,{"$f":"C9*0.002","v":0},1,null,null,"Muzzle E",{"$f":"(0.0000005*C2*J8*J8)","v":204.56970187499999},"MJ"]
["Shield",{"$f":"C10","v":0},{"$f":"IF(F10=1,0,J7*0.07)","v":0},0,{"$f":"C10*0.001","v":0},1]
{"$rows_left_out":56}